program: Orca
programVersion: 5.0.2
elementType: Br Cl Cl O O N N N N N C C C C C C C C C C C C C C C C C C H H H H H H H H H H H H H H
charge: 0
multiplicity: 1
keywords: wb97x-d3
keywords: def2-TZVPP
keywords: def2/J RIJCOSX
keywords: DEFGRID2
keywords: scfconv7
keywords: smallprint printgap noloewdin
keywords: NOSOSCF
formula: C18H14BrCl2N5O2
InChI: InChI=1/C18H14BrCl2N5O2/c1-9-6-10(20)7-11(17(27)22-2)15(9)24-18(28)13-8-14(19)25-26(13)16-12(21)4-3-5-23-16/h3-8,22,24H,1-2H3
42 atoms
Br -4.66115 -2.129807 -1.320841
Cl 6.801731 -1.312081 1.054834
Cl -2.483549 1.303963 2.74314
O  0.532419 0.84451 0.743152
O  1.821007 0.402031 -2.048416
N  0.971532 -1.299823 0.168051
N  -2.136791 0.561309 -0.119109
N  -3.341195 0.170446 -0.514869
N  3.033772 1.986622 -1.00667
N  -1.636091 2.717631 -0.838619
C  2.362365 -1.263718 0.374808
C  2.928242 -2.266659 1.167339
C  3.163669 -0.274586 -0.20315
C  -1.244602 -0.459483 -0.078225
C  0.159212 -0.238505 0.320198
C  4.30386 -2.273484 1.36247
C  4.535593 -0.286752 0.021334
C  2.073667 -3.322485 1.798643
C  5.090718 -1.287036 0.797523
C  -1.926174 -1.585581 -0.480165
C  2.59976 0.734298 -1.15925
C  -1.933071 1.936455 0.174039
C  -3.21867 -1.118945 -0.733226
C  -2.090145 2.393214 1.474638
C  -1.90174 3.74053 1.726265
C  -1.450312 4.010104 -0.599899
C  -1.571028 4.564213 0.663623
C  2.590547 3.062654 -1.863283
H  0.575713 -2.191947 -0.093304
H  4.750987 -3.050531 1.968519
H  5.170829 0.460572 -0.434704
H  1.300866 -2.885602 2.432106
H  1.568196 -3.936903 1.05041
H  2.675441 -3.987796 2.414126
H  -1.560011 -2.594287 -0.580556
H  3.617919 2.213408 -0.217613
H  -2.006691 4.136116 2.727077
H  -1.201461 4.628604 -1.451986
H  -1.409617 5.621768 0.81594
H  2.749484 2.824721 -2.91367
H  3.16831 3.950295 -1.625183
H  1.534202 3.292112 -1.71539
elementType: Br Cl O N C H
totalener: -4613.32852869 hartree
nucrepener: 3408.78414494 hartree
electener: -8022.11267362 hartree
twoeener: 5141.66772188 hartree
cpcmener: -0.06337116 hartree
kineticenergy: 4603.79150433 hartree
xcener: -219.222936581898 hartree
chargesum: 0.0000000
charge: 0.003029 -0.087724 -0.051710 -0.500933 -0.548257 -0.124992 0.189091 -0.284976 -0.163254 -0.333097 0.088487 -0.069725 -0.021866 -0.061956 0.392241 -0.101864 -0.172035 -0.241284 0.101682 -0.154987 0.364899 0.148568 0.000722 0.029008 -0.092646 0.003588 -0.093706 -0.159640 0.194416 0.129041 0.128961 0.115208 0.111439 0.097024 0.177612 0.189848 0.152117 0.154695 0.166906 0.110644 0.117611 0.097817
qa: 0.0030 -0.0877 -0.0517 -0.5009 -0.5483 -0.1250 0.1891 -0.2850 -0.1633 -0.3331 0.0885 -0.0697 -0.0219 -0.0620 0.3922 -0.1019 -0.1720 -0.2413 0.1017 -0.1550 0.3649 0.1486 0.0007 0.0290 -0.0926 0.0036 -0.0937 -0.1596 0.1944 0.1290 0.1290 0.1152 0.1114 0.0970 0.1776 0.1898 0.1521 0.1547 0.1669 0.1106 0.1176 0.0978
va: 1.2360 1.2166 1.2679 2.0052 1.9596 3.2809 3.2907 2.8488 3.2227 3.0512 3.7873 3.8912 3.7497 3.9714 4.1051 3.9585 4.0831 3.9053 3.8687 3.8971 4.1293 3.9802 4.2590 3.9931 3.9850 3.9917 3.8629 3.9060 0.9916 1.0152 1.0343 0.9968 0.9946 1.0054 0.9890 0.9969 1.0040 0.9957 0.9863 0.9977 0.9985 0.9866
dispcorr: -0.024942601 hartree
energy: -4613.353471287246
dipole: 57.21718 -55.36750 1.84968 27.81193 -27.25376 0.55817 9.27348 -7.37647 1.89702
magnitude: 2.70768 au
magnitude: 6.88237 debye
