program: Orca
programVersion: 5.0.2
elementType: Br Cl Cl O O N N N N N C C C C C C C C C C C C C C C C C C H H H H H H H H H H H H H H
charge: 0
multiplicity: 1
keywords: wb97x-d3
keywords: def2-TZVPP
keywords: def2/J RIJCOSX
keywords: DEFGRID2
keywords: scfconv7
keywords: smallprint printgap noloewdin
keywords: NOSOSCF
formula: C18H14BrCl2N5O2
InChI: InChI=1/C18H14BrCl2N5O2/c1-9-6-10(20)7-11(17(27)22-2)15(9)24-18(28)13-8-14(19)25-26(13)16-12(21)4-3-5-23-16/h3-8,22,24H,1-2H3
42 atoms
Br -4.801674 -2.144469 -0.182383
Cl 6.865346 -1.205022 0.451951
Cl -1.118991 1.514597 -3.037537
O  0.651121 1.049341 -0.028376
O  1.221658 -0.440252 2.650466
N  1.002155 -1.183554 -0.183663
N  -2.126658 0.661527 -0.355142
N  -3.380644 0.226594 -0.364255
N  2.563575 1.3632 2.527077
N  -2.174774 2.80675 0.538073
C  2.396575 -1.166194 -0.006993
C  3.179771 -1.861085 -0.934006
C  2.992209 -0.489602 1.061287
C  -1.227715 -0.348597 -0.2399
C  0.221431 -0.08738 -0.147102
C  4.55958 -1.873862 -0.772902
C  4.375942 -0.49292 1.190813
C  2.550834 -2.583022 -2.085858
C  5.144246 -1.187666 0.275563
C  -1.958473 -1.511324 -0.157865
C  2.170545 0.148577 2.140175
C  -1.897294 2.054953 -0.502229
C  -3.284175 -1.076869 -0.241879
C  -1.452382 2.561627 -1.715745
C  -1.271459 3.928256 -1.832108
C  -2.005823 4.118585 0.42761
C  -1.554396 4.72205 -0.733566
C  1.833817 2.119858 3.518428
H  0.58599 -2.069251 -0.434574
H  5.171841 -2.414647 -1.482686
H  4.848913 0.014606 2.020624
H  1.913164 -3.403689 -1.749599
H  1.930028 -1.916822 -2.686342
H  3.312265 -3.008621 -2.73601
H  -1.599832 -2.520227 -0.034651
H  3.29289 1.82948 2.010971
H  -0.921592 4.36306 -2.758307
H  -2.242019 4.711341 1.30139
H  -1.426818 5.794048 -0.78056
H  1.760375 1.577961 4.459916
H  0.826014 2.362206 3.177423
H  2.366194 3.048076 3.701785
elementType: Br Cl O N C H
totalener: -4613.32900968 hartree
nucrepener: 3406.29184237 hartree
electener: -8019.62085205 hartree
twoeener: 5138.91009313 hartree
cpcmener: -0.06176300 hartree
kineticenergy: 4603.79654567 hartree
xcener: -219.224179204346 hartree
chargesum: 0.0000000
charge: 0.003482 -0.087918 -0.052923 -0.497426 -0.546494 -0.116865 0.191876 -0.289211 -0.165391 -0.340939 0.064430 -0.047447 -0.005963 -0.072107 0.400933 -0.111573 -0.175427 -0.245027 0.106346 -0.180507 0.365188 0.162545 0.007590 0.029372 -0.089204 0.014433 -0.108889 -0.162300 0.196628 0.127901 0.128791 0.111776 0.114837 0.098801 0.178958 0.190297 0.152347 0.152460 0.167831 0.108453 0.103889 0.116451
qa: 0.0035 -0.0879 -0.0529 -0.4974 -0.5465 -0.1169 0.1919 -0.2892 -0.1654 -0.3409 0.0644 -0.0474 -0.0060 -0.0721 0.4009 -0.1116 -0.1754 -0.2450 0.1063 -0.1805 0.3652 0.1625 0.0076 0.0294 -0.0892 0.0144 -0.1089 -0.1623 0.1966 0.1279 0.1288 0.1118 0.1148 0.0988 0.1790 0.1903 0.1523 0.1525 0.1678 0.1085 0.1039 0.1165
va: 1.2360 1.2164 1.2665 2.0012 1.9638 3.2758 3.2903 2.8631 3.2171 3.0435 3.8069 3.8676 3.7502 3.9511 4.1001 3.9636 4.0867 3.8990 3.8646 3.9425 4.1260 3.9763 4.2595 3.9767 3.9817 4.0063 3.8727 3.9044 0.9888 1.0161 1.0341 0.9935 0.9979 1.0059 0.9894 0.9965 1.0037 0.9963 0.9861 0.9954 0.9942 0.9983
dispcorr: -0.024371112 hartree
energy: -4613.353380793038
dipole: 55.49384 -53.27729 2.21655 27.38690 -26.36725 1.01965 9.07478 -10.73535 -1.66057
magnitude: 2.95132 au
magnitude: 7.50165 debye
