program: Orca
programVersion: 5.0.2
elementType: Br Cl Cl O O N N N N N C C C C C C C C C C C C C C C C C C H H H H H H H H H H H H H H
charge: 0
multiplicity: 1
keywords: wb97x-d3
keywords: def2-TZVPP
keywords: def2/J RIJCOSX
keywords: DEFGRID2
keywords: scfconv7
keywords: smallprint printgap noloewdin
keywords: NOSOSCF
formula: C18H14BrCl2N5O2
InChI: InChI=1/C18H14BrCl2N5O2/c1-9-6-10(20)7-11(17(27)22-2)15(9)24-18(28)13-8-14(19)25-26(13)16-12(21)4-3-5-23-16/h3-8,22,24H,1-2H3
42 atoms
Br -4.855198 -2.03052 0.080934
Cl 6.809952 -1.113266 0.523378
Cl -0.673679 1.142541 -3.002335
O  0.574084 1.12744 0.265926
O  1.106693 -0.799687 2.709609
N  0.958761 -1.058278 -0.204854
N  -2.169121 0.725545 -0.421296
N  -3.4254 0.292299 -0.398947
N  2.43895 1.004521 2.924704
N  -2.377592 2.987353 0.049666
C  2.350764 -1.050786 -0.005243
C  3.160185 -1.543664 -1.032847
C  2.916222 -0.569547 1.178447
C  -1.278028 -0.260244 -0.150479
C  0.166289 0.01125 -0.015257
C  4.537356 -1.566184 -0.85094
C  4.29755 -0.579449 1.332797
C  2.561207 -2.035134 -2.314582
C  5.092119 -1.082428 0.319473
C  -2.008855 -1.400995 0.074077
C  2.062708 -0.129088 2.330039
C  -1.911693 2.074021 -0.771861
C  -3.333739 -0.981005 -0.096041
C  -1.229467 2.379797 -1.943101
C  -1.002957 3.711198 -2.244697
C  -2.174479 4.264558 -0.245988
C  -1.485025 4.673562 -1.374677
C  1.701629 1.573955 4.029019
H  0.550498 -1.896903 -0.596249
H  5.171027 -1.952274 -1.638591
H  4.748995 -0.224603 2.24946
H  3.338765 -2.331632 -3.01535
H  1.915733 -2.901812 -2.155652
H  1.953573 -1.264331 -2.79113
H  -1.645875 -2.377859 0.34846
H  3.177705 1.551107 2.511049
H  -0.469615 3.989834 -3.143191
H  -2.574208 4.990562 0.449592
H  -1.329911 5.724381 -1.573022
H  0.719087 1.933219 3.717556
H  2.265902 2.415872 4.420259
H  1.568913 0.850105 4.831803
elementType: Br Cl O N C H
totalener: -4613.32929692 hartree
nucrepener: 3412.65798699 hartree
electener: -8025.98728392 hartree
twoeener: 5145.13788174 hartree
cpcmener: -0.06133811 hartree
kineticenergy: 4603.79602886 hartree
xcener: -219.224102501232 hartree
chargesum: 0.0000000
charge: 0.003259 -0.087298 -0.054838 -0.489599 -0.546417 -0.101305 0.191088 -0.294473 -0.166467 -0.342609 0.068880 -0.046301 -0.004072 -0.008788 0.324113 -0.114782 -0.179386 -0.240111 0.111189 -0.215156 0.369263 0.176213 0.011621 0.030007 -0.087539 0.015131 -0.115186 -0.164492 0.197650 0.128543 0.129915 0.098787 0.111158 0.110718 0.182549 0.190370 0.154407 0.152958 0.167004 0.109947 0.117065 0.106984
qa: 0.0033 -0.0873 -0.0548 -0.4896 -0.5464 -0.1013 0.1911 -0.2945 -0.1665 -0.3426 0.0689 -0.0463 -0.0041 -0.0088 0.3241 -0.1148 -0.1794 -0.2401 0.1112 -0.2152 0.3693 0.1762 0.0116 0.0300 -0.0875 0.0151 -0.1152 -0.1645 0.1977 0.1285 0.1299 0.0988 0.1112 0.1107 0.1825 0.1904 0.1544 0.1530 0.1670 0.1099 0.1171 0.1070
va: 1.2354 1.2171 1.2673 1.9964 1.9606 3.2508 3.2899 2.8680 3.2195 3.0591 3.7930 3.8670 3.7409 3.8755 4.1601 3.9717 4.0889 3.9028 3.8608 3.9762 4.1170 3.9874 4.2513 3.9553 3.9750 4.0180 3.8837 3.9024 0.9889 1.0160 1.0339 1.0065 0.9935 0.9980 0.9903 0.9964 1.0027 0.9959 0.9866 0.9916 0.9981 0.9966
dispcorr: -0.024581711 hartree
energy: -4613.353878633160
dipole: 55.07328 -52.64763 2.42565 26.82577 -25.72621 1.09955 6.08344 -7.90546 -1.82202
magnitude: 3.22685 au
magnitude: 8.20201 debye
