program: Orca
programVersion: 5.0.2
elementType: Br Cl Cl O O N N N N N C C C C C C C C C C C C C C C C C C H H H H H H H H H H H H H H
charge: 0
multiplicity: 1
keywords: wb97x-d3
keywords: def2-TZVPP
keywords: def2/J RIJCOSX
keywords: DEFGRID2
keywords: scfconv7
keywords: smallprint printgap noloewdin
keywords: NOSOSCF
formula: C18H14BrCl2N5O2
InChI: InChI=1/C18H14BrCl2N5O2/c1-9-6-10(20)7-11(17(27)22-2)15(9)24-18(28)13-8-14(19)25-26(13)16-12(21)4-3-5-23-16/h3-8,22,24H,1-2H3
42 atoms
Br -4.348994 0.388398 2.740599
Cl 6.951097 -1.400466 -0.055752
Cl -3.453706 0.57988 -2.57284
O  0.550471 -0.11098 -1.124502
O  1.059249 -2.951258 0.387119
N  1.303183 -0.09014 1.017768
N  -1.832875 1.184266 -0.103819
N  -3.014786 1.304817 0.495129
N  2.033561 -3.037196 -1.64008
N  -0.572849 2.851608 -1.103651
C  2.641065 -0.433594 0.748087
C  3.63921 0.42222 1.22289
C  2.970507 -1.580459 0.022333
C  -0.978476 0.396215 0.591959
C  0.359117 0.04479 0.070475
C  4.96905 0.103786 0.977221
C  4.305767 -1.869703 -0.234874
C  3.289181 1.668151 1.976743
C  5.289285 -1.027326 0.249084
C  -1.656958 -0.038658 1.702318
C  1.926094 -2.571134 -0.395178
C  -1.536898 1.966853 -1.244137
C  -2.916568 0.563378 1.572012
C  -2.245834 1.791635 -2.424774
C  -1.932307 2.60265 -3.503204
C  -0.258106 3.612758 -2.142645
C  -0.916816 3.530957 -3.358282
C  1.11865 -4.021137 -2.170967
H  1.079493 0.207004 1.958672
H  5.749392 0.756174 1.346655
H  4.578135 -2.762093 -0.782262
H  2.794421 1.443139 2.924048
H  4.182861 2.245439 2.203667
H  2.613063 2.304304 1.403752
H  -1.309508 -0.710971 2.469194
H  2.73014 -2.647416 -2.254735
H  -2.462052 2.500114 -4.440367
H  0.54734 4.320308 -1.996339
H  -0.639164 4.178018 -4.177852
H  0.096413 -3.643497 -2.207762
H  1.129577 -4.936711 -1.580721
H  1.428265 -4.265209 -3.182459
elementType: Br Cl O N C H
totalener: -4613.32833994 hartree
nucrepener: 3374.09296208 hartree
electener: -7987.42130203 hartree
twoeener: 5106.86952538 hartree
cpcmener: -0.05844113 hartree
kineticenergy: 4603.79954748 hartree
xcener: -219.221932201592 hartree
chargesum: 0.0000000
charge: 0.001933 -0.087166 -0.049940 -0.498189 -0.549825 -0.128615 0.178068 -0.300689 -0.166419 -0.353258 0.068233 -0.049100 -0.001663 0.023737 0.317998 -0.115669 -0.178750 -0.237712 0.112000 -0.200257 0.373112 0.207707 0.015022 0.011557 -0.085642 0.013009 -0.110877 -0.168133 0.198148 0.129667 0.128289 0.111539 0.098397 0.111727 0.184894 0.190434 0.150946 0.151370 0.168216 0.109049 0.110213 0.116637
qa: 0.0019 -0.0872 -0.0499 -0.4982 -0.5498 -0.1286 0.1781 -0.3007 -0.1664 -0.3533 0.0682 -0.0491 -0.0017 0.0237 0.3180 -0.1157 -0.1788 -0.2377 0.1120 -0.2003 0.3731 0.2077 0.0150 0.0116 -0.0856 0.0130 -0.1109 -0.1681 0.1981 0.1297 0.1283 0.1115 0.0984 0.1117 0.1849 0.1904 0.1509 0.1514 0.1682 0.1090 0.1102 0.1166
va: 1.2353 1.2171 1.2658 1.9904 1.9571 3.2560 3.3206 2.8260 3.2219 3.0489 3.7965 3.8770 3.7403 3.8752 4.1705 3.9706 4.0905 3.9009 3.8604 3.9164 4.1067 3.8801 4.2330 4.0120 3.9666 4.0089 3.8774 3.9046 0.9892 1.0153 1.0346 0.9936 1.0058 1.0007 0.9918 0.9967 1.0038 0.9955 0.9861 0.9917 0.9934 0.9980
dispcorr: -0.023761587 hartree
energy: -4613.352101528167
dipole: 56.79246 -54.57017 2.22229 -3.60049 5.03937 1.43889 -29.76615 28.47592 -1.29023
magnitude: 2.94511 au
magnitude: 7.48587 debye
