program: Orca
programVersion: 5.0.2
elementType: Br Cl Cl O O N N N N N C C C C C C C C C C C C C C C C C C H H H H H H H H H H H H H H
charge: 0
multiplicity: 1
keywords: wb97x-d3
keywords: def2-TZVPP
keywords: def2/J RIJCOSX
keywords: DEFGRID2
keywords: scfconv7
keywords: smallprint printgap noloewdin
keywords: NOSOSCF
formula: C18H14BrCl2N5O2
InChI: InChI=1/C18H14BrCl2N5O2/c1-9-6-10(20)7-11(17(27)22-2)15(9)24-18(28)13-8-14(19)25-26(13)16-12(21)4-3-5-23-16/h3-8,22,24H,1-2H3
42 atoms
Br -4.743141 -2.321285 -1.115648
Cl 6.778659 -1.480637 0.701524
Cl -1.828146 1.308135 2.098803
O  0.724671 0.741206 -1.015028
O  1.52048 1.308464 1.922383
N  0.903409 -1.124851 0.266005
N  -2.118357 0.514162 -0.747206
N  -3.362762 0.070885 -0.906437
N  2.958068 2.352037 0.533973
N  -1.883005 2.67431 -1.602502
C  2.305585 -1.167052 0.381184
C  2.933192 -2.396179 0.14739
C  3.060621 -0.037417 0.70777
C  -1.227281 -0.49433 -0.588282
C  0.222467 -0.225796 -0.466896
C  4.314694 -2.480334 0.260628
C  4.445689 -0.137053 0.789482
C  2.140072 -3.610907 -0.227666
C  5.057405 -1.356217 0.571559
C  -1.935468 -1.666875 -0.684815
C  2.425846 1.264586 1.095885
C  -1.891167 1.899639 -0.541591
C  -3.253071 -1.236683 -0.886907
C  -1.711922 2.370655 0.753202
C  -1.460874 3.719694 0.935049
C  -1.661099 3.970582 -1.428114
C  -1.430559 4.533744 -0.183416
C  2.424997 3.674619 0.767376
H  0.389093 -1.914453 0.633625
H  4.803039 -3.430355 0.087947
H  5.038602 0.727864 1.05438
H  2.798781 -4.454194 -0.423267
H  1.454291 -3.910892 0.567694
H  1.541216 -3.439226 -1.123284
H  -1.555749 -2.67475 -0.646145
H  3.631739 2.233837 -0.20573
H  -1.302324 4.125569 1.924669
H  -1.663203 4.586377 -2.317756
H  -1.237226 5.592819 -0.089778
H  1.41073 3.778132 0.375384
H  3.061868 4.396486 0.263461
H  2.410739 3.917964 1.829343
elementType: Br Cl O N C H
totalener: -4613.32715953 hartree
nucrepener: 3451.05281104 hartree
electener: -8064.37997057 hartree
twoeener: 5183.61318409 hartree
cpcmener: -0.06209199 hartree
kineticenergy: 4603.78910239 hartree
xcener: -219.221201202264 hartree
chargesum: -0.0000000
charge: 0.002335 -0.087743 -0.049738 -0.486789 -0.537133 -0.134483 0.174988 -0.284122 -0.162256 -0.326772 0.075436 -0.060565 0.006029 -0.054989 0.374010 -0.108834 -0.168330 -0.246028 0.098961 -0.163456 0.353531 0.145271 -0.004553 0.050849 -0.122190 0.014750 -0.093031 -0.164832 0.193622 0.128598 0.130233 0.099266 0.113086 0.115612 0.188223 0.187619 0.155902 0.153121 0.167643 0.093168 0.123197 0.110395
qa: 0.0023 -0.0877 -0.0497 -0.4868 -0.5371 -0.1345 0.1750 -0.2841 -0.1623 -0.3268 0.0754 -0.0606 0.0060 -0.0550 0.3740 -0.1088 -0.1683 -0.2460 0.0990 -0.1635 0.3535 0.1453 -0.0046 0.0508 -0.1222 0.0147 -0.0930 -0.1648 0.1936 0.1286 0.1302 0.0993 0.1131 0.1156 0.1882 0.1876 0.1559 0.1531 0.1676 0.0932 0.1232 0.1104
va: 1.2345 1.2167 1.2679 2.0100 1.9796 3.2713 3.2807 2.8592 3.2110 3.0628 3.7916 3.8844 3.6821 3.9070 4.1309 3.9597 4.0743 3.9034 3.8709 3.8998 4.1273 4.0020 4.2673 3.9367 3.9659 4.0178 3.8450 3.9074 0.9964 1.0156 1.0335 1.0060 0.9933 0.9958 0.9830 0.9984 1.0035 0.9965 0.9861 0.9885 0.9998 0.9969
dispcorr: -0.027061517 hartree
energy: -4613.354221045471
dipole: 56.95270 -54.89523 2.05747 30.80250 -30.66568 0.13683 8.38840 -8.25220 0.13620
magnitude: 2.06651 au
magnitude: 5.25264 debye
