program: Orca
programVersion: 5.0.2
elementType: Br Cl Cl O O N N N N N C C C C C C C C C C C C C C C C C C H H H H H H H H H H H H H H
charge: 0
multiplicity: 1
keywords: wb97x-d3
keywords: def2-TZVPP
keywords: def2/J RIJCOSX
keywords: DEFGRID2
keywords: scfconv7
keywords: smallprint printgap noloewdin
keywords: NOSOSCF
formula: C18H14BrCl2N5O2
InChI: InChI=1/C18H14BrCl2N5O2/c1-9-6-10(20)7-11(17(27)22-2)15(9)24-18(28)13-8-14(19)25-26(13)16-12(21)4-3-5-23-16/h3-8,22,24H,1-2H3
42 atoms
Br -4.781685 -2.285617 -1.069955
Cl 6.771369 -1.462518 0.754734
Cl -1.802781 1.205753 2.162622
O  0.721225 0.678545 -1.124785
O  1.536862 1.467045 1.702566
N  0.900447 -1.104243 0.270174
N  -2.121653 0.516389 -0.704952
N  -3.374532 0.089124 -0.83903
N  2.971229 2.362035 0.205075
N  -1.848008 2.701491 -1.488113
C  2.30212 -1.145149 0.391506
C  2.92083 -2.395412 0.271987
C  3.065237 0.003337 0.619073
C  -1.236858 -0.503613 -0.591121
C  0.218489 -0.24611 -0.508527
C  4.301157 -2.478872 0.396898
C  4.448861 -0.098552 0.715707
C  2.119443 -3.633636 0.008783
C  5.051684 -1.337111 0.609814
C  -1.958168 -1.666851 -0.69381
C  2.43695 1.339559 0.879171
C  -1.86654 1.889581 -0.454956
C  -3.277021 -1.219357 -0.850789
C  -1.661486 2.309657 0.853075
C  -1.36522 3.643264 1.078981
C  -1.589215 3.983881 -1.270715
C  -1.327089 4.495671 -0.009404
C  2.412191 3.69313 0.252814
H  0.381319 -1.855226 0.705632
H  4.783986 -3.44353 0.311221
H  5.047593 0.782383 0.903606
H  2.772304 -4.493089 -0.126517
H  1.445509 -3.863704 0.837053
H  1.506532 -3.533411 -0.887888
H  -1.588537 -2.679129 -0.687733
H  3.623401 2.157058 -0.535803
H  -1.182495 4.007299 2.080456
H  -1.586215 4.630325 -2.138416
H  -1.100793 5.544497 0.118967
H  3.123085 4.385337 -0.188917
H  2.228417 4.0067 1.277813
H  1.475901 3.75862 -0.305099
elementType: Br Cl O N C H
totalener: -4613.32657694 hartree
nucrepener: 3459.81020822 hartree
electener: -8073.13678516 hartree
twoeener: 5192.38096352 hartree
cpcmener: -0.06081064 hartree
kineticenergy: 4603.79661697 hartree
xcener: -219.222616530697 hartree
chargesum: 0.0000000
charge: 0.001935 -0.087641 -0.051366 -0.483660 -0.536695 -0.131381 0.171925 -0.285045 -0.162970 -0.323946 0.073023 -0.059403 0.003338 -0.053704 0.364388 -0.108868 -0.164281 -0.245485 0.097387 -0.162449 0.350516 0.142312 -0.002859 0.054176 -0.106882 0.025510 -0.119593 -0.165940 0.194821 0.128058 0.131061 0.099081 0.113848 0.115530 0.189509 0.187047 0.155816 0.152626 0.166685 0.125796 0.107289 0.100490
qa: 0.0019 -0.0876 -0.0514 -0.4837 -0.5367 -0.1314 0.1719 -0.2850 -0.1630 -0.3239 0.0730 -0.0594 0.0033 -0.0537 0.3644 -0.1089 -0.1643 -0.2455 0.0974 -0.1624 0.3505 0.1423 -0.0029 0.0542 -0.1069 0.0255 -0.1196 -0.1659 0.1948 0.1281 0.1311 0.0991 0.1138 0.1155 0.1895 0.1870 0.1558 0.1526 0.1667 0.1258 0.1073 0.1005
va: 1.2341 1.2169 1.2667 2.0124 1.9820 3.2634 3.2764 2.8591 3.2102 3.0633 3.7944 3.8814 3.6726 3.9037 4.1416 3.9607 4.0679 3.9014 3.8688 3.8947 4.1362 4.0036 4.2644 3.9336 3.9635 3.9998 3.8669 3.8928 0.9958 1.0158 1.0328 1.0058 0.9928 0.9962 0.9827 0.9981 1.0032 0.9969 0.9870 1.0007 1.0005 0.9920
dispcorr: -0.027564152 hartree
energy: -4613.354141087443
dipole: 57.42294 -55.33696 2.08598 30.45709 -30.46733 -0.01024 7.26008 -7.02801 0.23207
magnitude: 2.09888 au
magnitude: 5.33492 debye
