program: Orca
programVersion: 5.0.2
elementType: Br Cl Cl O O N N N N N C C C C C C C C C C C C C C C C C C H H H H H H H H H H H H H H
charge: 0
multiplicity: 1
keywords: wb97x-d3
keywords: def2-TZVPP
keywords: def2/J RIJCOSX
keywords: DEFGRID2
keywords: scfconv7
keywords: smallprint printgap noloewdin
keywords: NOSOSCF
formula: C18H14BrCl2N5O2
InChI: InChI=1/C18H14BrCl2N5O2/c1-9-6-10(20)7-11(17(27)22-2)15(9)24-18(28)13-8-14(19)25-26(13)16-12(21)4-3-5-23-16/h3-8,22,24H,1-2H3
42 atoms
Br -4.737404 -2.263534 -0.865626
Cl 6.89637 -1.281989 0.404482
Cl -1.862429 2.12643 -2.841644
O  0.705044 0.913591 -0.391774
O  1.387733 0.129838 2.608178
N  1.00891 -1.288664 0.047224
N  -2.099249 0.53339 -0.336981
N  -3.34334 0.10202 -0.497589
N  2.726356 1.817766 1.934787
N  -1.810926 2.345515 1.093741
C  2.411806 -1.262714 0.151873
C  3.141743 -2.171452 -0.620157
C  3.063513 -0.357614 0.991521
C  -1.193494 -0.473986 -0.345471
C  0.255249 -0.207228 -0.228537
C  4.527904 -2.174388 -0.523341
C  4.451854 -0.358403 1.057055
C  2.446845 -3.125969 -1.542011
C  5.168576 -1.269601 0.303581
C  -1.907364 -1.635984 -0.530093
C  2.297344 0.551056 1.907411
C  -1.881311 1.923626 -0.146319
C  -3.233698 -1.200472 -0.616089
C  -1.780286 2.761284 -1.248478
C  -1.592007 4.1143 -1.028051
C  -1.628676 3.641246 1.30979
C  -1.513151 4.561256 0.280088
C  2.092238 2.831523 2.741632
H  0.55864 -2.188574 0.137341
H  5.101725 -2.878407 -1.112122
H  4.967361 0.32696 1.716836
H  1.843312 -3.852597 -0.99291
H  1.77718 -2.60413 -2.227659
H  3.166381 -3.68518 -2.137177
H  -1.535763 -2.644833 -0.609256
H  3.384855 2.119091 1.234041
H  -1.503437 4.802296 -1.857903
H  -1.573382 3.957474 2.34379
H  -1.363283 5.609893 0.495649
H  1.912849 2.469579 3.752186
H  1.139366 3.153681 2.315724
H  2.751573 3.693599 2.802035
elementType: Br Cl O N C H
totalener: -4613.33344490 hartree
nucrepener: 3406.28455598 hartree
electener: -8019.61800089 hartree
twoeener: 5138.55476222 hartree
cpcmener: -0.05100431 hartree
kineticenergy: 4603.79649931 hartree
xcener: -219.220456451072 hartree
chargesum: -0.0000000
charge: 0.001439 -0.086715 -0.049984 -0.472742 -0.504825 -0.140766 0.181057 -0.281832 -0.170230 -0.323194 0.089176 -0.070126 -0.000550 -0.036403 0.361635 -0.106300 -0.173093 -0.240147 0.101939 -0.153335 0.333161 0.158683 -0.002293 0.032362 -0.095158 -0.014105 -0.087011 -0.160762 0.187396 0.125591 0.129052 0.110532 0.113187 0.096881 0.174192 0.183147 0.148466 0.153332 0.163134 0.106459 0.102533 0.116216
qa: 0.0014 -0.0867 -0.0500 -0.4727 -0.5048 -0.1408 0.1811 -0.2818 -0.1702 -0.3232 0.0892 -0.0701 -0.0006 -0.0364 0.3616 -0.1063 -0.1731 -0.2401 0.1019 -0.1533 0.3332 0.1587 -0.0023 0.0324 -0.0952 -0.0141 -0.0870 -0.1608 0.1874 0.1256 0.1291 0.1105 0.1132 0.0969 0.1742 0.1831 0.1485 0.1533 0.1631 0.1065 0.1025 0.1162
va: 1.2333 1.2175 1.2690 2.0377 2.0159 3.2752 3.3104 2.8412 3.1995 3.0636 3.7786 3.8971 3.6996 3.9327 4.1406 3.9675 4.0800 3.9054 3.8767 3.8814 4.1653 3.9554 4.2601 4.0089 3.9878 4.0066 3.8538 3.9079 0.9983 1.0161 1.0349 0.9941 0.9968 1.0062 0.9905 1.0007 1.0054 0.9949 0.9876 1.0025 0.9815 0.9990
dispcorr: -0.025327989 hartree
energy: -4613.358772893291
dipole: 56.62772 -54.71882 1.90890 27.69260 -26.84686 0.84574 17.00320 -17.97782 -0.97462
magnitude: 2.30414 au
magnitude: 5.85667 debye
