program: Orca
programVersion: 5.0.2
elementType: Br Cl Cl O O N N N N N C C C C C C C C C C C C C C C C C C H H H H H H H H H H H H H H
charge: 0
multiplicity: 1
keywords: wb97x-d3
keywords: def2-TZVPP
keywords: def2/J RIJCOSX
keywords: DEFGRID2
keywords: scfconv7
keywords: smallprint printgap noloewdin
keywords: NOSOSCF
formula: C18H14BrCl2N5O2
InChI: InChI=1/C18H14BrCl2N5O2/c1-9-6-10(20)7-11(17(27)22-2)15(9)24-18(28)13-8-14(19)25-26(13)16-12(21)4-3-5-23-16/h3-8,22,24H,1-2H3
42 atoms
Br -4.719447 -2.333748 -1.113649
Cl 6.792049 -1.479721 0.674998
Cl -1.884079 1.416562 2.095113
O  0.731182 0.789411 -0.930203
O  1.516841 1.173275 2.062373
N  0.917681 -1.145077 0.242418
N  -2.115444 0.517915 -0.729147
N  -3.352289 0.065513 -0.89909
N  2.920244 2.31964 0.712492
N  -1.873286 2.644859 -1.65222
C  2.318265 -1.186038 0.363082
C  2.955472 -2.394396 0.059008
C  3.061827 -0.071831 0.757485
C  -1.214607 -0.481594 -0.57208
C  0.232459 -0.205618 -0.437029
C  4.337297 -2.473798 0.171978
C  4.446991 -0.163145 0.837319
C  2.167307 -3.586772 -0.391088
C  5.069803 -1.362859 0.54979
C  -1.914437 -1.659948 -0.672105
C  2.407121 1.194396 1.225423
C  -1.901005 1.910749 -0.564478
C  -3.235305 -1.241042 -0.877628
C  -1.749851 2.429968 0.714966
C  -1.514511 3.788116 0.848396
C  -1.667111 3.947579 -1.527013
C  -1.468663 4.560175 -0.298964
C  2.379452 3.623209 1.0114
H  0.40325 -1.934112 0.608875
H  4.837309 -3.406678 -0.054058
H  5.0307 0.690446 1.155451
H  2.826979 -4.412705 -0.649801
H  1.489355 -3.945387 0.387323
H  1.559423 -3.357263 -1.268187
H  -1.532611 -2.667298 -0.635866
H  3.546434 2.244823 -0.07364
H  -1.379261 4.231364 1.825753
H  -1.655659 4.526402 -2.441923
H  -1.288715 5.624475 -0.239909
H  1.475822 3.831129 0.433767
H  3.123547 4.378283 0.769304
H  2.140198 3.709433 2.068999
elementType: Br Cl O N C H
totalener: -4613.33132348 hartree
nucrepener: 3445.33235803 hartree
electener: -8058.66368152 hartree
twoeener: 5177.47493253 hartree
cpcmener: -0.04960045 hartree
kineticenergy: 4603.80317318 hartree
xcener: -219.221369960866 hartree
chargesum: -0.0000000
charge: 0.001431 -0.086788 -0.046982 -0.459025 -0.497434 -0.138566 0.176259 -0.278302 -0.168859 -0.321267 0.084918 -0.063607 0.006132 -0.052543 0.360005 -0.109361 -0.168882 -0.247776 0.097619 -0.165027 0.329703 0.148648 -0.005035 0.053828 -0.125345 0.012239 -0.096638 -0.164452 0.187462 0.126271 0.130701 0.098546 0.110508 0.114465 0.181352 0.181493 0.153080 0.149775 0.164098 0.101873 0.120453 0.105032
qa: 0.0014 -0.0868 -0.0470 -0.4590 -0.4974 -0.1386 0.1763 -0.2783 -0.1689 -0.3213 0.0849 -0.0636 0.0061 -0.0525 0.3600 -0.1094 -0.1689 -0.2478 0.0976 -0.1650 0.3297 0.1486 -0.0050 0.0538 -0.1253 0.0122 -0.0966 -0.1645 0.1875 0.1263 0.1307 0.0985 0.1105 0.1145 0.1814 0.1815 0.1531 0.1498 0.1641 0.1019 0.1205 0.1050
va: 1.2332 1.2179 1.2703 2.0451 2.0264 3.2638 3.2980 2.8587 3.1964 3.0654 3.7836 3.8783 3.6668 3.8913 4.1547 3.9648 4.0715 3.9046 3.8810 3.8999 4.1607 3.9960 4.2681 3.9498 3.9654 4.0253 3.8497 3.8986 0.9998 1.0163 1.0333 1.0069 0.9936 0.9958 0.9860 1.0019 1.0043 0.9968 0.9872 0.9890 0.9999 1.0055
dispcorr: -0.026885236 hartree
energy: -4613.358208718697
dipole: 56.59861 -54.75328 1.84533 30.74799 -30.44305 0.30495 8.36760 -8.35322 0.01439
magnitude: 1.87041 au
magnitude: 4.75420 debye
