program: Orca
programVersion: 5.0.2
elementType: Br Cl Cl O O N N N N N C C C C C C C C C C C C C C C C C C H H H H H H H H H H H H H H
charge: 0
multiplicity: 1
keywords: wb97x-d3
keywords: def2-TZVPP
keywords: def2/J RIJCOSX
keywords: DEFGRID2
keywords: scfconv7
keywords: smallprint printgap noloewdin
keywords: NOSOSCF
formula: C18H14BrCl2N5O2
InChI: InChI=1/C18H14BrCl2N5O2/c1-9-6-10(20)7-11(17(27)22-2)15(9)24-18(28)13-8-14(19)25-26(13)16-12(21)4-3-5-23-16/h3-8,22,24H,1-2H3
42 atoms
Br -4.681272 -2.330002 -1.046749
Cl 6.867056 -1.389433 0.459395
Cl -1.713521 1.866675 1.868728
O  0.748606 0.872153 -0.654088
O  1.501933 0.547387 2.507078
N  0.978874 -1.227176 0.170312
N  -2.059724 0.519654 -0.778979
N  -3.291039 0.064407 -0.972656
N  2.772435 2.08858 1.449309
N  -1.855155 2.469428 -2.025432
C  2.383472 -1.241446 0.26173
C  3.064868 -2.302442 -0.342654
C  3.082095 -0.229203 0.919484
C  -1.17512 -0.472984 -0.511321
C  0.267031 -0.200404 -0.334149
C  4.451483 -2.340231 -0.262652
C  4.470547 -0.267274 0.966176
C  2.318572 -3.377956 -1.071347
C  5.139098 -1.32608 0.379436
C  -1.888537 -1.648807 -0.547904
C  2.360404 0.837974 1.687266
C  -1.842586 1.921753 -0.833013
C  -3.193149 -1.237011 -0.839311
C  -1.673184 2.64602 0.339608
C  -1.476023 4.012662 0.244258
C  -1.67819 3.779854 -2.120418
C  -1.475772 4.58947 -1.014256
C  2.156711 3.238389 2.064575
H  0.499365 -2.086894 0.396421
H  4.989111 -3.160819 -0.719664
H  5.020636 0.507033 1.484298
H  3.005932 -4.083125 -1.534953
H  1.670063 -3.94823 -0.4021
H  1.684207 -2.962711 -1.856395
H  -1.529105 -2.655886 -0.411109
H  3.380528 2.250184 0.661913
H  -1.33601 4.613336 1.13279
H  -1.696205 4.200464 -3.117961
H  -1.326724 5.653621 -1.132563
H  2.833857 4.085275 1.984062
H  1.963728 3.056533 3.119579
H  1.214173 3.503703 1.579825
elementType: Br Cl O N C H
totalener: -4613.33225388 hartree
nucrepener: 3433.08306645 hartree
electener: -8046.41532032 hartree
twoeener: 5165.10415693 hartree
cpcmener: -0.04963019 hartree
kineticenergy: 4603.79961046 hartree
xcener: -219.221545069114 hartree
chargesum: -0.0000000
charge: 0.002044 -0.086959 -0.047397 -0.465483 -0.496411 -0.139858 0.182597 -0.281410 -0.169401 -0.332537 0.098236 -0.079444 0.001931 -0.052337 0.374920 -0.107384 -0.169888 -0.241308 0.105182 -0.168590 0.322450 0.173911 0.001092 0.021766 -0.096362 0.008885 -0.105529 -0.160109 0.186522 0.125489 0.130828 0.097631 0.109791 0.113988 0.173374 0.182475 0.155210 0.148725 0.162436 0.117966 0.107552 0.095408
qa: 0.0020 -0.0870 -0.0474 -0.4655 -0.4964 -0.1399 0.1826 -0.2814 -0.1694 -0.3325 0.0982 -0.0794 0.0019 -0.0523 0.3749 -0.1074 -0.1699 -0.2413 0.1052 -0.1686 0.3224 0.1739 0.0011 0.0218 -0.0964 0.0089 -0.1055 -0.1601 0.1865 0.1255 0.1308 0.0976 0.1098 0.1140 0.1734 0.1825 0.1552 0.1487 0.1624 0.1180 0.1076 0.0954
va: 1.2338 1.2173 1.2732 2.0453 2.0257 3.2754 3.3173 2.8620 3.1862 3.0676 3.7692 3.9077 3.6961 3.9075 4.1462 3.9676 4.0739 3.9076 3.8715 3.9130 4.1690 3.9656 4.2645 3.9799 3.9466 4.0333 3.8811 3.9089 0.9998 1.0161 1.0321 1.0066 0.9945 0.9957 0.9904 1.0018 1.0021 0.9971 0.9882 1.0013 1.0048 0.9844
dispcorr: -0.026332620 hartree
energy: -4613.358586495434
dipole: 55.67550 -53.93238 1.74313 29.46902 -28.80200 0.66702 7.75273 -8.16315 -0.41042
magnitude: 1.91098 au
magnitude: 4.85734 debye
