program: Orca
programVersion: 5.0.2
elementType: Br Cl Cl O O N N N N N C C C C C C C C C C C C C C C C C C H H H H H H H H H H H H H H
charge: 0
multiplicity: 1
keywords: wb97x-d3
keywords: def2-TZVPP
keywords: def2/J RIJCOSX
keywords: DEFGRID2
keywords: scfconv7
keywords: smallprint printgap noloewdin
keywords: NOSOSCF
formula: C18H14BrCl2N5O2
InChI: InChI=1/C18H14BrCl2N5O2/c1-9-6-10(20)7-11(17(27)22-2)15(9)24-18(28)13-8-14(19)25-26(13)16-12(21)4-3-5-23-16/h3-8,22,24H,1-2H3
42 atoms
Br -4.824996 0.163144 2.220384
Cl 6.840346 -0.600661 0.577279
Cl -0.707369 -0.795495 -2.294511
O  0.761194 1.536644 -0.343797
O  1.239272 -2.996842 0.870906
N  0.984912 -0.137644 1.171702
N  -2.059722 1.083492 -0.339966
N  -3.326294 0.982577 0.047434
N  2.243058 -3.012763 -1.145018
N  -2.205088 2.834125 -1.843353
C  2.388011 -0.238735 1.052868
C  3.209675 0.800985 1.491131
C  2.940404 -1.386169 0.476469
C  -1.193733 0.636887 0.604442
C  0.271133 0.727455 0.42291
C  4.587048 0.670344 1.330755
C  4.314371 -1.50216 0.326208
C  2.660642 2.035588 2.13453
C  5.124252 -0.464048 0.753479
C  -1.955315 0.224083 1.670615
C  2.057929 -2.531817 0.085377
C  -1.794061 1.605603 -1.629951
C  -3.269925 0.469494 1.251712
C  -1.17964 0.829773 -2.606758
C  -0.962902 1.393674 -3.851796
C  -2.012832 3.371352 -3.039295
C  -1.386362 2.693361 -4.071662
C  1.495447 -4.142734 -1.645626
H  0.502276 -0.910582 1.610061
H  5.236785 1.465161 1.674353
H  4.748336 -2.39545 -0.103346
H  1.75956 1.830188 2.711354
H  3.3969 2.475046 2.806173
H  2.408331 2.791789 1.389751
H  -1.616171 -0.167056 2.615769
H  2.876772 -2.538156 -1.767832
H  -0.483116 0.825296 -4.636904
H  -2.369402 4.384427 -3.177158
H  -1.237004 3.167953 -5.0312
H  1.801719 -4.331162 -2.669003
H  0.421519 -3.955223 -1.640947
H  1.687145 -5.041406 -1.059434
elementType: Br Cl O N C H
totalener: -4613.33447858 hartree
nucrepener: 3416.80416003 hartree
electener: -8030.13863861 hartree
twoeener: 5148.19473316 hartree
cpcmener: -0.04386390 hartree
kineticenergy: 4603.80111205 hartree
xcener: -219.220355591399 hartree
chargesum: 0.0000000
charge: 0.001871 -0.085172 -0.063197 -0.457114 -0.518584 -0.157056 0.186683 -0.287497 -0.179552 -0.337955 0.080330 -0.002517 -0.007863 0.013953 0.287856 -0.140599 -0.180245 -0.229705 0.124232 -0.209540 0.345965 0.186893 0.012306 0.036985 -0.086838 0.013827 -0.119716 -0.163156 0.193536 0.123288 0.132893 0.104104 0.107431 0.110377 0.178605 0.188568 0.150710 0.149287 0.162976 0.116702 0.100626 0.116303
qa: 0.0019 -0.0852 -0.0632 -0.4571 -0.5186 -0.1571 0.1867 -0.2875 -0.1796 -0.3380 0.0803 -0.0025 -0.0079 0.0140 0.2879 -0.1406 -0.1802 -0.2297 0.1242 -0.2095 0.3460 0.1869 0.0123 0.0370 -0.0868 0.0138 -0.1197 -0.1632 0.1935 0.1233 0.1329 0.1041 0.1074 0.1104 0.1786 0.1886 0.1507 0.1493 0.1630 0.1167 0.1006 0.1163
va: 1.2340 1.2190 1.2692 2.0417 1.9885 3.1980 3.3042 2.8735 3.1899 3.0685 3.7446 3.8901 3.7404 3.8322 4.1963 4.0227 4.0544 3.8646 3.8476 3.9576 4.1421 3.9841 4.2496 3.9558 3.9705 4.0242 3.8862 3.9050 1.0193 1.0177 1.0306 1.0057 1.0023 1.0056 0.9916 0.9978 1.0039 0.9964 0.9881 0.9971 0.9917 0.9943
dispcorr: -0.025082408 hartree
energy: -4613.359560984836
dipole: 54.51003 -52.54537 1.96466 -1.96600 1.41918 -0.54681 -25.20707 23.20584 -2.00123
magnitude: 2.85724 au
magnitude: 7.26253 debye
