program: Gaussian 09
title: 000054586
version: EM64L-G09RevD.01
frameworkgroup: C1[X(C22H25N7O5)]
method: RPBEPBE
basis: SDD
operation: Freq
keyword: #p
keyword: freq=noraman
keyword: PBEPBE/SDD
title: #p freq=noraman PBEPBE/SDD
converged: YES YES NO NO
title: Mulliken charges:
elementType: O O O O O N N N N N N N C C C C C C C C C C C C C C C C C C C C C C H H H H H H H H H H H H H H H H H H H H H H H H H
charge: -0.268604 -0.409134 -0.234237 -0.471385 -0.349673 -0.395944 -0.034029 0.046112 -0.000816 -0.399088 -0.630437 -0.600548 -0.201584 -0.587283 -0.389253 0.510991 0.254565 -0.699354 -0.383559 -0.440014 0.286246 -0.421300 -0.375995 -0.119798 -0.403011 0.109038 -0.449075 -0.467769 -0.058219 0.130407 -0.046976 0.324971 0.251822 0.103773 0.218117 0.223519 0.224027 0.204528 0.206639 0.228739 0.233511 0.218618 0.238595 0.209619 0.262835 0.265101 0.293591 0.238999 0.255701 0.343863 0.256647 0.227045 0.224103 0.384519 0.370414 0.364828 0.391529 0.399176 0.334898
chargesum: 0.00000
title: Mulliken charges with hydrogens summed into heavy atoms:
elementType: O O O O O N N N N N N N C C C C C C C C C C C C C C C C C C C C C C
charge: -0.268604 -0.024615 -0.234237 -0.471385 -0.349673 -0.052081 -0.034029 0.046112 -0.000816 -0.007559 0.104805 0.133526 0.016533 -0.139737 0.021913 0.510991 0.254565 -0.032522 -0.154820 -0.206503 0.286246 -0.158465 -0.110895 0.173793 0.091689 0.109038 -0.192427 -0.016621 -0.058219 0.130407 -0.046976 0.324971 0.251822 0.103773
polarizability: 4.23590333e+02 -2.16360538e+01 2.61539236e+02 -1.01755269e+01 3.39250076e+01 2.41004350e+02
1716.lowfreq: -10.7448 -6.8052 -5.8808 -0.0005 0.0004 0.0006 4.8640 22.0876 29.8611
frequency: -7.6893 21.9907 29.7954 40.0347 48.1496 51.2473 55.4836 64.8453 77.0571 81.5083 90.6697 94.3063 105.7307 127.5918 132.1449 152.7400 154.3498 177.0809 184.4730 204.3792 204.8935 222.7970 231.5005 243.9109 248.7945 261.0813 280.6573 288.7026 307.3080 322.1353 345.9143 361.2267 365.3823 395.6702 407.9655 435.2887 448.4083 453.7790 462.8636 467.0679 475.6395 517.6063 532.9381 551.9527 555.8151 561.4259 577.9095 589.3039 593.6336 598.1068 613.2353 616.2982 627.3828 629.7007 632.1954 639.6948 656.3307 687.2172 693.8821 701.0342 704.3087 709.3652 727.5169 740.4980 760.7926 769.6196 792.4715 803.0567 807.2603 813.7851 849.4575 858.8248 881.3824 896.7631 902.9239 907.6254 918.7102 926.4469 929.6582 935.0939 953.8320 968.2149 980.4091 1003.4057 1012.5564 1019.4811 1026.0058 1036.6311 1041.7648 1064.3481 1070.5196 1082.1812 1089.8492 1100.2150 1114.7454 1123.4718 1149.3193 1153.4473 1158.4199 1164.7807 1192.4062 1200.3841 1229.1081 1239.5827 1252.1613 1254.3110 1262.2943 1269.7188 1280.6560 1286.5251 1291.1157 1302.1180 1305.9482 1314.3983 1326.3983 1336.2912 1341.3750 1344.2005 1348.9257 1352.6667 1371.9713 1381.2929 1385.9913 1392.5045 1404.6821 1426.4802 1449.1753 1453.5908 1454.1711 1458.5349 1468.1206 1474.6601 1476.9911 1484.6901 1490.4314 1500.9530 1523.5604 1555.1409 1564.1747 1588.4910 1590.1568 1601.0018 1613.4970 1634.2204 1655.1856 1667.1925 1791.1174 2966.8940 2974.9463 2980.1175 2997.0684 3002.1343 3016.0746 3019.7524 3020.6838 3068.8887 3073.7328 3079.6571 3083.4804 3085.0678 3088.5510 3115.1962 3117.8127 3123.4860 3138.3502 3159.2409 3476.7912 3515.6778 3531.7859 3618.8382 3628.7279
redmass: 5.9166 7.6882 6.1237 5.5920 4.8660 7.4065 9.2453 5.7711 5.5156 3.6799 6.9282 4.9450 5.9883 4.9416 4.8299 4.0586 3.7959 4.9918 5.0773 3.5542 3.6490 5.1977 3.7131 4.2386 1.8571 3.0634 4.2579 5.1504 3.5256 3.0813 3.5937 3.0163 4.9937 4.9158 2.8381 5.4350 4.1387 3.5948 3.8737 3.1528 5.5158 3.7510 3.8302 2.9587 4.6254 3.1473 1.8001 3.2269 3.1807 3.4233 1.3170 1.9965 2.8819 2.3184 3.3384 1.9031 1.2637 4.8778 4.0028 4.2795 4.8031 5.0552 3.7848 5.9952 3.0375 2.7615 2.2244 2.4178 3.3501 9.4451 1.5683 1.3693 2.2344 2.6984 1.6826 3.6136 2.2906 2.2940 1.7259 1.3893 3.1247 1.4455 1.4126 3.4658 3.1897 2.4069 3.1740 2.3827 2.1183 2.4835 4.6929 2.1066 2.1043 3.0720 1.6451 2.0157 1.3247 1.5409 2.0850 2.0351 1.1666 2.0284 1.3084 1.3037 1.4232 1.6035 3.0942 1.8963 1.6873 1.7424 1.6333 2.3135 1.3870 1.5379 1.4752 1.9092 1.8693 1.2578 1.9730 1.8964 1.9993 3.5169 6.0565 1.2264 2.4033 3.4461 2.1832 1.2091 1.5199 1.0863 1.0830 1.9746 1.0421 1.0600 3.3605 2.6913 5.0616 3.3071 6.4536 7.0412 2.0645 4.2017 6.2278 2.6300 8.2814 1.4562 1.1929 1.0651 1.0773 1.0370 1.0796 1.0592 1.0592 1.0633 1.1009 1.1034 1.0995 1.1021 1.1001 1.0967 1.0833 1.0871 1.0919 1.0893 1.0961 1.0954 1.0451 1.0642 1.0782 1.0835 1.1060
irintensity: 0.2880 5.7189 0.5697 1.4319 0.3535 0.9141 0.1242 3.1739 2.8265 0.3160 0.3513 0.2857 0.9293 9.2718 4.5285 2.8640 2.4162 2.5488 5.5041 2.9617 0.9872 3.8910 0.1492 6.7368 6.3348 3.8598 2.7982 3.7150 8.6293 17.6732 8.8079 7.7513 14.7512 9.6628 0.0726 2.7428 11.4272 66.1880 8.3056 8.4374 9.1524 1.7900 192.5643 3.0151 41.8562 52.4856 180.7765 21.8970 43.1658 6.3623 104.3997 40.4624 48.4418 143.3044 72.5825 25.6594 310.0085 177.7062 61.5385 4.1685 16.1020 101.4081 4.0656 22.9153 8.6798 821.6696 90.6128 11.2308 20.8547 11.5447 27.5899 19.0269 516.1341 136.3632 1.0083 21.6801 1.8437 10.2180 2.7754 408.5885 42.9615 16.2508 8.3254 3.3810 14.4299 26.0259 627.2966 88.7492 70.1200 44.3364 29.2323 37.6087 9.2951 26.4225 8.3696 57.0661 1.8871 16.1848 13.5565 2.0430 15.3734 2.4488 9.4884 1.0819 9.8495 3.1680 18.0696 62.6859 15.5221 34.8888 11.9890 34.0236 3.3384 8.8173 11.0992 222.4655 8.1467 57.1038 16.3491 57.2572 21.1548 2.1026 24.3108 13.5718 4.3335 158.9318 7.7229 20.8252 34.1252 20.0402 9.9553 191.3919 11.0056 10.7873 28.7182 27.5029 32.2791 154.9011 43.6419 127.1922 602.7030 319.2314 32.7673 546.8359 229.2194 284.1327 420.8308 22.6332 26.2846 30.4998 20.5719 43.0477 14.4604 37.6244 30.2590 7.4192 42.2564 9.8069 46.3408 363.1178 881.4088 9.3891 13.1857 12.9330 9.6745 2.6519 130.1723 33.8157 51.7787 110.6713 109.2593
temp: 298.150 k
press: 1.00000 atm
elementType: 8 8 8 8 8 7 7 7 7 7 7 7 6 6 6 6 6 6 6 6 6 6 6 6 6 6 6 6 6 6 6 6 6 6 1 1 1 1 1 1 1 1 1 1 1 1 1 1 1 1 1 1 1 1 1 1 1 1 1
symmnumber: 1
zpe: 1202970.2 jmol-1
zpe.correction: 0.458187 hartree
zpe.thermalcorrener: 0.488439 hartree
zpe.thermalcorrenthalpy: 0.489383 hartree
zpe.thermalcorrgfe: 0.396794 hartree
zpe.sumelectzpe: -1610.347040 hartree
zpe.sumelectthermal: -1610.316788 hartree
zpe.sumelectthermalent: -1610.315844 hartree
zpe.sumelectthermalfe: -1610.408433 hartree
dipole: 2.4104 -2.2959 -4.7099
dipole: 5.7675
quadrupole: -168.4386 -216.3795 -200.4927
quadrupole: -3.0834 3.4027 7.3320
quadrupole: 26.6650 -21.2759 -5.3891 -3.0834 3.4027 7.3320
hfenergy: -1610.8052268 hartree
pointgroup: C01 [X(C22H25N7O5)]
dipole: 0.5196721 -1.1562471 -1.8820015 debye
polarizability: 385.0281511|-72.1064109|298.6028275|0.8414801|37.0248881|242.5029413 unknown
InChI: InChI=1S/C22H25N7O5/c1-2-11-9-14-10-25-19-17(26-14)18(23)29(22(24)28-19)35-34-16(30)8-7-15(21(32)33)27-20(31)13-5-3-12(11)4-6-13/h3-6,10-11,15,27,32H,2,7-9,23-24H2,1H3
charge 0 multiplicity 1
59 atoms
O  -2.521935 -1.619193 2.306106
O  -6.145292 -0.551097 -0.881086
O  -4.144172 -0.879395 -2.010327
O  -2.204085 2.364358 -1.008434
O  -2.605065 3.737374 0.795861
N  -2.672142 -0.449185 0.299927
N  2.649373 0.064094 -1.415697
N  4.039906 1.528124 0.623089
N  2.15214 2.961417 0.875272
N  0.220116 2.627874 -0.581572
N  0.178016 1.014018 -2.290748
N  0.136203 4.141959 1.192504
C  3.522659 -2.847578 -0.160791
C  4.158935 -1.844054 -1.206603
C  3.676702 -4.302915 -0.687985
C  2.074658 -2.484254 0.187512
C  3.79798 -0.417427 -0.879668
C  3.31629 -5.375973 0.360203
C  1.042747 -2.504911 -0.78748
C  1.738545 -2.058581 1.499333
C  -0.58172 -1.626555 0.834285
C  -0.263487 -2.068714 -0.47722
C  0.427036 -1.654484 1.828172
C  -4.12004 -0.260124 0.401093
C  -4.609214 1.125327 0.930289
C  -1.986522 -1.234779 1.21684
C  4.508273 0.380185 0.089295
C  -4.438265 2.345519 -0.021306
C  2.148562 1.213368 -0.871496
C  -4.749935 -0.59752 -0.953393
C  2.773243 1.932625 0.209495
C  0.830177 1.641879 -1.281068
C  -3.009832 2.875049 -0.062852
C  0.876144 3.239693 0.498813
H  4.117825 -2.762607 0.771851
H  5.253696 -1.999109 -1.209911
H  3.774703 -2.085372 -2.214253
H  3.040801 -4.430796 -1.587148
H  4.723726 -4.447241 -1.023708
H  1.263504 -2.849047 -1.804735
H  2.515838 -2.041947 2.273066
H  3.442332 -6.39244 -0.054701
H  2.268823 -5.272145 0.694821
H  3.964586 -5.293612 1.252894
H  -1.048187 -2.102434 -1.243053
H  0.170689 -1.35702 2.850265
H  -4.470958 -1.009207 1.139571
H  -5.686798 1.014775 1.147302
H  -4.096922 1.318222 1.889837
H  -2.193644 -0.034734 -0.503648
H  5.498768 0.058601 0.434563
H  -5.077935 3.160837 0.358071
H  -4.771136 2.090159 -1.043067
H  -6.532046 -0.78095 -1.769095
H  -0.793248 1.244211 -2.51477
H  0.653659 0.218432 -2.720283
H  -0.988758 2.677942 -0.779075
H  -0.900779 4.186704 1.048766
H  0.580762 4.579052 1.998375
