program: Orca
programVersion: 5.0.2
elementType: Br Cl Cl O O N N N N N C C C C C C C C C C C C C C C C C C H H H H H H H H H H H H H H
charge: 0
multiplicity: 1
keywords: wb97x-d3
keywords: def2-TZVPP
keywords: def2/J RIJCOSX
keywords: DEFGRID2
keywords: scfconv7
keywords: smallprint printgap noloewdin
keywords: NOSOSCF
formula: C18H14BrCl2N5O2
InChI: InChI=1/C18H14BrCl2N5O2/c1-9-6-10(20)7-11(17(27)22-2)15(9)24-18(28)13-8-14(19)25-26(13)16-12(21)4-3-5-23-16/h3-8,22,24H,1-2H3
42 atoms
Br -4.327176 -1.469632 -2.395652
Cl 6.788546 -0.814884 1.576576
Cl -3.93947 1.967374 1.660307
O  0.213492 -0.029492 1.690729
O  3.84594 0.295493 -2.688581
N  1.132979 -1.125718 -0.085188
N  -1.930343 0.633644 -0.185189
N  -3.039653 0.473909 -0.90523
N  1.906819 1.044826 -1.830013
N  -0.408282 2.369514 -0.06413
C  2.481809 -1.032431 0.332475
C  2.89508 -1.6908 1.493907
C  3.395602 -0.321633 -0.452454
C  -1.148145 -0.474285 -0.180737
C  0.119479 -0.517274 0.590149
C  4.22824 -1.591997 1.869882
C  4.733629 -0.281689 -0.08009
C  1.956458 -2.513486 2.322562
C  5.133192 -0.89332 1.09097
C  -1.804331 -1.41607 -0.928759
C  3.069913 0.362126 -1.757356
C  -1.586529 1.909405 0.303264
C  -2.976925 -0.756394 -1.342987
C  -2.453655 2.622781 1.125211
C  -2.059678 3.884473 1.540105
C  -0.022552 3.56367 0.356448
C  -0.823937 4.367155 1.149044
C  1.548676 1.76701 -3.027301
H  0.975826 -1.28165 -1.069163
H  4.565854 -2.088121 2.770276
H  5.449146 0.230996 -0.707358
H  1.391977 -1.887518 3.013778
H  1.236156 -3.04857 1.703987
H  2.505622 -3.250173 2.907499
H  -1.516884 -2.436536 -1.116023
H  1.366946 1.250933 -1.003384
H  -2.710752 4.467501 2.176681
H  0.959772 3.892067 0.041024
H  -0.486369 5.344793 1.461886
H  0.550182 2.17435 -2.889425
H  1.538687 1.107956 -3.893964
H  2.238906 2.585503 -3.239699
totalener: -4613.29632509 hartree
nucrepener: 3412.95627418 hartree
electener: -8026.25259927 hartree
twoeener: 5142.29266646 hartree
kineticenergy: 4603.85741560 hartree
xcener: -219.224799984937 hartree
chargesum: 0.0000000
charge: 0.016565 -0.069546 -0.017289 -0.350819 -0.390523 -0.209079 0.161972 -0.272284 -0.254630 -0.375445 0.113165 -0.032832 -0.009305 0.018679 0.212303 -0.102820 -0.134366 -0.242564 0.093183 -0.205593 0.292300 0.287744 0.036394 -0.019774 -0.081928 0.078040 -0.123188 -0.160014 0.156708 0.101539 0.122856 0.125048 0.090947 0.090864 0.163486 0.197471 0.126320 0.116047 0.135324 0.096269 0.111203 0.107574
qa: 0.0166 -0.0695 -0.0173 -0.3508 -0.3905 -0.2091 0.1620 -0.2723 -0.2546 -0.3754 0.1132 -0.0328 -0.0093 0.0187 0.2123 -0.1028 -0.1344 -0.2426 0.0932 -0.2056 0.2923 0.2877 0.0364 -0.0198 -0.0819 0.0780 -0.1232 -0.1600 0.1567 0.1015 0.1229 0.1250 0.0909 0.0909 0.1635 0.1975 0.1263 0.1160 0.1353 0.0963 0.1112 0.1076
va: 1.2430 1.2347 1.2980 2.1486 2.1327 3.1977 3.3349 2.8245 3.1289 3.0444 3.7636 3.9480 3.7683 3.7387 4.2250 4.0114 4.0774 3.8702 3.9251 3.9217 4.1837 3.8180 4.2195 4.0942 3.9875 3.9830 3.9598 3.9145 1.0330 1.0244 1.0338 1.0024 1.0063 1.0058 0.9996 1.0080 1.0134 1.0033 0.9993 1.0049 1.0001 0.9929
dispcorr: -0.026295656 hartree
energy: -4613.322620745950
dipole: 53.33378 -54.18178 -0.84800 18.57854 -17.67032 0.90822 18.22272 -17.47332 0.74939
magnitude: 1.45105 au
magnitude: 3.68828 debye
