program: Orca
programVersion: 5.0.2
elementType: Br Cl Cl O O N N N N N C C C C C C C C C C C C C C C C C C H H H H H H H H H H H H H H
charge: 0
multiplicity: 1
keywords: wb97x-d3
keywords: def2-TZVPP
keywords: def2/J RIJCOSX
keywords: DEFGRID2
keywords: scfconv7
keywords: smallprint printgap noloewdin
keywords: NOSOSCF
formula: C18H14BrCl2N5O2
InChI: InChI=1/C18H14BrCl2N5O2/c1-9-6-10(20)7-11(17(27)22-2)15(9)24-18(28)13-8-14(19)25-26(13)16-12(21)4-3-5-23-16/h3-8,22,24H,1-2H3
42 atoms
Br -4.686803 -0.113132 2.012134
Cl 6.975151 -0.588211 0.768445
Cl -1.718733 3.619746 -0.954711
O  0.776498 0.985242 -0.964554
O  1.311781 -3.01819 1.334628
N  1.079447 -0.311934 0.884755
N  -2.03072 0.674017 -0.702936
N  -3.279522 0.599876 -0.265962
N  2.80664 -3.823158 -0.14414
N  -1.734616 0.235444 -2.968885
C  2.481235 -0.359805 0.82866
C  3.23514 0.815215 0.923878
C  3.122807 -1.600242 0.717552
C  -1.125709 0.283638 0.225391
C  0.326113 0.356488 -0.032739
C  4.621557 0.720538 0.882917
C  4.509995 -1.669868 0.708927
C  2.603417 2.159552 1.115862
C  5.250406 -0.505412 0.778473
C  -1.848046 -0.0702 1.341504
C  2.322274 -2.864192 0.669601
C  -1.793822 1.138654 -2.022331
C  -3.17819 0.152268 0.963015
C  -1.664037 2.503094 -2.252047
C  -1.467174 2.929141 -3.552627
C  -1.537532 0.640589 -4.213851
C  -1.401808 1.976169 -4.555065
C  2.132691 -5.089017 -0.309727
H  0.647763 -1.086492 1.373362
H  5.216122 1.621213 0.962238
H  5.014305 -2.626415 0.678149
H  1.70847 2.098054 1.734408
H  3.298673 2.840791 1.604097
H  2.311125 2.59998 0.163221
H  -1.484368 -0.413329 2.294917
H  3.518863 -3.571644 -0.806621
H  -1.360516 3.982422 -3.771446
H  -1.489256 -0.133735 -4.969561
H  -1.245572 2.267581 -5.584207
H  1.21581 -4.995419 -0.89424
H  1.87445 -5.510021 0.65903
H  2.801586 -5.779324 -0.817758
totalener: -4613.30011444 hartree
nucrepener: 3355.81716624 hartree
electener: -7969.11728069 hartree
twoeener: 5086.55388648 hartree
kineticenergy: 4603.86594405 hartree
xcener: -219.226961084324 hartree
chargesum: -0.0000000
charge: 0.005245 -0.070530 -0.040593 -0.391611 -0.436666 -0.213389 0.171864 -0.250507 -0.207838 -0.282930 0.097547 0.008312 -0.016245 -0.054410 0.336285 -0.120631 -0.207280 -0.236570 0.098790 -0.158659 0.376203 0.166876 0.014230 0.056750 -0.105402 -0.002963 -0.083343 -0.152581 0.182074 0.101867 0.122139 0.095549 0.088982 0.125079 0.145972 0.147879 0.123145 0.119273 0.129311 0.111384 0.111500 0.095890
qa: 0.0052 -0.0705 -0.0406 -0.3916 -0.4367 -0.2134 0.1719 -0.2505 -0.2078 -0.2829 0.0975 0.0083 -0.0162 -0.0544 0.3363 -0.1206 -0.2073 -0.2366 0.0988 -0.1587 0.3762 0.1669 0.0142 0.0567 -0.1054 -0.0030 -0.0833 -0.1526 0.1821 0.1019 0.1221 0.0955 0.0890 0.1251 0.1460 0.1479 0.1231 0.1193 0.1293 0.1114 0.1115 0.0959
va: 1.2337 1.2356 1.2790 2.1087 2.0652 3.1921 3.3351 2.8460 3.1969 3.0996 3.8686 3.9071 3.7243 3.8894 4.1388 4.0339 4.0594 3.8738 3.9494 3.9398 4.0897 3.9585 4.2455 4.0325 4.0222 4.0687 3.8730 3.9149 1.0489 1.0229 1.0401 1.0073 1.0055 1.0047 1.0051 1.0224 1.0152 1.0015 0.9987 0.9908 1.0023 0.9989
dispcorr: -0.023457158 hartree
energy: -4613.323571603193
dipole: 57.08399 -55.55958 1.52441 -11.32870 11.03597 -0.29272 -25.39971 24.24186 -1.15784
magnitude: 1.93652 au
magnitude: 4.92224 debye
