program: Orca
programVersion: 5.0.2
elementType: Br Cl Cl O O N N N N N C C C C C C C C C C C C C C C C C C H H H H H H H H H H H H H H
charge: 0
multiplicity: 1
keywords: wb97x-d3
keywords: def2-TZVPP
keywords: def2/J RIJCOSX
keywords: DEFGRID2
keywords: scfconv7
keywords: smallprint printgap noloewdin
keywords: NOSOSCF
formula: C18H14BrCl2N5O2
InChI: InChI=1/C18H14BrCl2N5O2/c1-9-6-10(20)7-11(17(27)22-2)15(9)24-18(28)13-8-14(19)25-26(13)16-12(21)4-3-5-23-16/h3-8,22,24H,1-2H3
42 atoms
Br -4.647358 -1.125048 1.471039
Cl 7.013023 -0.654592 0.571089
Cl -1.890217 3.448338 -0.47666
O  0.791639 0.967029 -1.013796
O  1.341186 -2.939789 1.504983
N  1.129678 -0.272386 0.8675
N  -1.98884 0.497946 -0.840504
N  -3.2365 0.187634 -0.52001
N  2.734828 -3.846844 -0.010527
N  -1.628509 0.556096 -3.139703
C  2.531099 -0.335084 0.786475
C  3.305977 0.828306 0.796111
C  3.146087 -1.593097 0.724978
C  -1.088233 0.064719 0.074577
C  0.359518 0.306904 -0.09493
C  4.688918 0.703498 0.710868
C  4.529753 -1.691656 0.669372
C  2.704335 2.19233 0.940516
C  5.291395 -0.538267 0.646875
C  -1.813736 -0.580018 1.050399
C  2.317967 -2.839959 0.78033
C  -1.758528 1.238291 -2.029366
C  -3.138813 -0.465005 0.613533
C  -1.721025 2.626436 -1.971952
C  -1.527976 3.323921 -3.149821
C  -1.43917 1.221213 -4.268051
C  -1.381863 2.604296 -4.323735
C  2.022994 -5.101659 -0.073573
H  0.717924 -1.018898 1.412283
H  5.302968 1.594563 0.720955
H  5.015835 -2.658209 0.671138
H  3.412353 2.871213 1.413732
H  2.430888 2.607807 -0.028337
H  1.802829 2.171104 1.55106
H  -1.461743 -1.064975 1.945258
H  3.422061 -3.648983 -0.716109
H  -1.491125 4.404372 -3.14463
H  -1.331956 0.624526 -5.165628
H  -1.22755 3.110458 -5.266351
H  1.863991 -5.500698 0.925741
H  2.61884 -5.814494 -0.637974
H  1.049945 -4.998348 -0.556654
totalener: -4613.30015182 hartree
nucrepener: 3363.47913339 hartree
electener: -7976.77928521 hartree
twoeener: 5094.20942463 hartree
kineticenergy: 4603.85812541 hartree
xcener: -219.226110596252 hartree
chargesum: -0.0000000
charge: 0.005029 -0.070517 -0.042765 -0.394135 -0.437954 -0.227845 0.174709 -0.247098 -0.208138 -0.279109 0.121801 -0.000996 -0.032974 -0.086469 0.370105 -0.109536 -0.195030 -0.243657 0.091377 -0.149053 0.370492 0.173860 0.013068 0.046296 -0.104447 -0.000483 -0.085829 -0.151469 0.181735 0.102547 0.123114 0.089894 0.124448 0.095951 0.143381 0.148786 0.123969 0.119289 0.128910 0.111644 0.095186 0.111912
qa: 0.0050 -0.0705 -0.0428 -0.3941 -0.4380 -0.2278 0.1747 -0.2471 -0.2081 -0.2791 0.1218 -0.0010 -0.0330 -0.0865 0.3701 -0.1095 -0.1950 -0.2437 0.0914 -0.1491 0.3705 0.1739 0.0131 0.0463 -0.1044 -0.0005 -0.0858 -0.1515 0.1817 0.1025 0.1231 0.0899 0.1244 0.0960 0.1434 0.1488 0.1240 0.1193 0.1289 0.1116 0.0952 0.1119
va: 1.2333 1.2354 1.2771 2.1110 2.0652 3.2049 3.3292 2.8561 3.1997 3.0995 3.8343 3.9100 3.7545 3.9172 4.1178 4.0202 4.0494 3.8798 3.9530 3.9330 4.0912 3.9633 4.2505 4.0425 4.0201 4.0700 3.8756 3.9173 1.0508 1.0219 1.0384 1.0047 1.0039 1.0085 1.0060 1.0224 1.0147 1.0014 0.9989 1.0001 0.9991 0.9915
dispcorr: -0.023628360 hartree
energy: -4613.323780182124
dipole: 56.97303 -55.48480 1.48823 -0.09911 0.02719 -0.07192 -20.18101 19.22096 -0.96005
magnitude: 1.77248 au
magnitude: 4.50530 debye
