program: Orca
programVersion: 5.0.2
elementType: Br Cl Cl O O N N N N N C C C C C C C C C C C C C C C C C C H H H H H H H H H H H H H H
charge: 0
multiplicity: 1
keywords: wb97x-d3
keywords: def2-TZVPP
keywords: def2/J RIJCOSX
keywords: DEFGRID2
keywords: scfconv7
keywords: smallprint printgap noloewdin
keywords: NOSOSCF
formula: C18H14BrCl2N5O2
InChI: InChI=1/C18H14BrCl2N5O2/c1-9-6-10(20)7-11(17(27)22-2)15(9)24-18(28)13-8-14(19)25-26(13)16-12(21)4-3-5-23-16/h3-8,22,24H,1-2H3
42 atoms
Br -4.881753 -1.358388 -1.434059
Cl 6.986222 -1.151283 1.085062
Cl -2.351609 2.97496 -0.988852
O  0.941925 -1.455358 -1.624478
O  2.513959 2.419279 0.884448
N  1.127754 -0.798595 0.533431
N  -1.697706 0.229111 0.121073
N  -3.013523 0.16405 -0.08274
N  2.2749 1.594439 -1.214802
N  -0.490711 1.066029 1.928208
C  2.537517 -0.916973 0.608383
C  3.126178 -2.146242 0.904646
C  3.314567 0.220436 0.428308
C  -1.020222 -0.742708 -0.564207
C  0.443698 -1.01606 -0.609458
C  4.506846 -2.198032 1.043076
C  4.690862 0.163651 0.58714
C  2.291663 -3.380348 1.057481
C  5.273053 -1.053002 0.892362
C  -1.970332 -1.462385 -1.239855
C  2.655866 1.525428 0.075018
C  -1.214627 1.332067 0.859438
C  -3.18347 -0.854379 -0.884123
C  -1.512814 2.633467 0.465869
C  -1.059687 3.674441 1.261386
C  -0.027171 2.0610 2.666123
C  -0.309167 3.385994 2.383986
C  1.58512 2.730089 -1.773916
H  0.635255 -0.405451 1.331856
H  4.989131 -3.138593 1.274052
H  5.296838 1.051155 0.466747
H  1.830504 -3.652543 0.107255
H  2.893895 -4.22388 1.389985
H  1.487437 -3.236788 1.778893
H  -1.804572 -2.306065 -1.886603
H  2.384734 0.773408 -1.787545
H  -1.279886 4.696098 0.984717
H  0.590493 1.788277 3.51092
H  0.076589 4.174989 3.012455
H  1.905395 3.640335 -1.273244
H  0.500867 2.647188 -1.676034
H  1.825861 2.81333 -2.831672
totalener: -4613.29545421 hartree
nucrepener: 3482.48427968 hartree
electener: -8095.77973388 hartree
twoeener: 5212.39543860 hartree
kineticenergy: 4603.87840613 hartree
xcener: -219.230654691057 hartree
chargesum: -0.0000000
charge: 0.011909 -0.068642 -0.028572 -0.373689 -0.399300 -0.182797 0.159779 -0.290569 -0.168862 -0.338744 0.170044 -0.065095 0.008644 0.061005 0.143998 -0.098385 -0.137262 -0.238701 0.102765 -0.179631 0.197608 0.211238 0.040256 -0.032416 -0.067170 0.044178 -0.060611 -0.161263 0.200948 0.102695 0.119477 0.114428 0.087315 0.096998 0.165430 0.163481 0.125992 0.120525 0.128135 0.110274 0.091772 0.112814
qa: 0.0119 -0.0686 -0.0286 -0.3737 -0.3993 -0.1828 0.1598 -0.2906 -0.1689 -0.3387 0.1700 -0.0651 0.0086 0.0610 0.1440 -0.0984 -0.1373 -0.2387 0.1028 -0.1796 0.1976 0.2112 0.0403 -0.0324 -0.0672 0.0442 -0.0606 -0.1613 0.2009 0.1027 0.1195 0.1144 0.0873 0.0970 0.1654 0.1635 0.1260 0.1205 0.1281 0.1103 0.0918 0.1128
va: 1.2391 1.2364 1.2820 2.1259 2.1062 3.0600 3.2989 2.7919 3.1519 3.0921 3.6901 3.9782 3.7976 3.7750 4.3315 3.9860 4.0497 3.9095 3.9082 3.9174 4.2632 3.8742 4.1802 4.0205 3.9794 4.0293 3.9105 3.8953 1.0488 1.0243 1.0233 1.0014 1.0094 1.0017 1.0021 1.0216 1.0118 1.0053 1.0000 1.0118 0.9980 1.0031
dispcorr: -0.029374730 hartree
energy: -4613.324828936289
dipole: 58.99036 -58.72913 0.26123 14.38740 -13.67787 0.70953 17.31832 -16.80718 0.51114
magnitude: 0.91266 au
magnitude: 2.31979 debye
