program: Orca
programVersion: 5.0.2
elementType: Br Cl Cl O O N N N N N C C C C C C C C C C C C C C C C C C H H H H H H H H H H H H H H
charge: 0
multiplicity: 1
keywords: wb97x-d3
keywords: def2-TZVPP
keywords: def2/J RIJCOSX
keywords: DEFGRID2
keywords: scfconv7
keywords: smallprint printgap noloewdin
keywords: NOSOSCF
formula: C18H14BrCl2N5O2
InChI: InChI=1/C18H14BrCl2N5O2/c1-9-6-10(20)7-11(17(27)22-2)15(9)24-18(28)13-8-14(19)25-26(13)16-12(21)4-3-5-23-16/h3-8,22,24H,1-2H3
42 atoms
Br -4.851949 -1.528759 0.726546
Cl 6.848201 -0.886095 0.435813
Cl -1.191704 3.019232 0.496263
O  0.676029 0.705455 -1.406514
O  1.134668 -1.358477 2.770852
N  0.957203 -1.017502 0.058913
N  -2.118899 0.6093 -1.007134
N  -3.378831 0.330461 -0.705315
N  2.614319 0.141776 3.555684
N  -2.067572 1.639376 -3.090385
C  2.35929 -0.97318 0.121635
C  3.136226 -1.139913 -1.029444
C  2.97677 -0.799333 1.368507
C  -1.24154 -0.265923 -0.45607
C  0.215227 -0.12901 -0.659428
C  4.520866 -1.088993 -0.908825
C  4.361998 -0.783464 1.465231
C  2.534898 -1.426005 -2.37074
C  5.125463 -0.91097 0.320454
C  -1.998353 -1.17716 0.243519
C  2.150864 -0.70133 2.613271
C  -1.854856 1.754194 -1.803402
C  -3.314889 -0.743194 0.044839
C  -1.440362 2.935745 -1.198824
C  -1.224076 4.040142 -2.001165
C  -1.86581 2.696757 -3.860586
C  -1.44106 3.917766 -3.363281
C  1.913137 0.33962 4.802247
H  0.52428 -1.444902 0.868216
H  5.133475 -1.219993 -1.791235
H  4.848098 -0.703728 2.428405
H  3.244262 -1.964782 -2.997453
H  1.636544 -2.036344 -2.28384
H  2.256339 -0.507567 -2.885483
H  -1.671095 -2.033705 0.808211
H  3.339012 0.79065 3.304608
H  -0.896296 4.974112 -1.566492
H  -2.051575 2.561947 -4.91902
H  -1.283993 4.75771 -4.025259
H  1.677634 -0.617359 5.262406
H  0.980011 0.889217 4.667631
H  2.553077 0.899387 5.479516
totalener: -4613.30006486 hartree
nucrepener: 3378.23581135 hartree
electener: -7991.53587621 hartree
twoeener: 5108.89797891 hartree
kineticenergy: 4603.85954472 hartree
xcener: -219.227265003162 hartree
chargesum: 0.0000000
charge: 0.005116 -0.070281 -0.049346 -0.392375 -0.438887 -0.220020 0.176930 -0.245049 -0.207259 -0.275814 0.111838 0.000993 -0.027133 -0.079798 0.357983 -0.111521 -0.197616 -0.241034 0.091277 -0.159031 0.373641 0.170714 0.016331 0.052305 -0.103285 -0.001506 -0.088273 -0.151502 0.182651 0.102448 0.121333 0.088251 0.097972 0.127249 0.144392 0.148211 0.122938 0.120525 0.129000 0.112074 0.110025 0.095532
qa: 0.0051 -0.0703 -0.0493 -0.3924 -0.4389 -0.2200 0.1769 -0.2450 -0.2073 -0.2758 0.1118 0.0010 -0.0271 -0.0798 0.3580 -0.1115 -0.1976 -0.2410 0.0913 -0.1590 0.3736 0.1707 0.0163 0.0523 -0.1033 -0.0015 -0.0883 -0.1515 0.1827 0.1024 0.1213 0.0883 0.0980 0.1272 0.1444 0.1482 0.1229 0.1205 0.1290 0.1121 0.1100 0.0955
va: 1.2332 1.2359 1.2699 2.1088 2.0636 3.1988 3.3285 2.8664 3.2021 3.0945 3.8528 3.9054 3.7408 3.8959 4.1244 4.0218 4.0512 3.8718 3.9562 3.9509 4.0889 3.9780 4.2490 4.0224 4.0227 4.0682 3.8754 3.9169 1.0512 1.0221 1.0399 1.0049 1.0064 1.0041 1.0057 1.0227 1.0147 1.0008 0.9988 1.0011 0.9914 0.9992
dispcorr: -0.023574170 hartree
energy: -4613.323639025897
dipole: 56.53509 -54.92838 1.60671 15.31136 -14.12350 1.18786 -5.82530 6.26390 0.43860
magnitude: 2.04570 au
magnitude: 5.19975 debye
