program: Orca
programVersion: 5.0.2
elementType: Br Cl Cl O O N N N N N C C C C C C C C C C C C C C C C C C H H H H H H H H H H H H H H
charge: 0
multiplicity: 1
keywords: wb97x-d3
keywords: def2-TZVPP
keywords: def2/J RIJCOSX
keywords: DEFGRID2
keywords: scfconv7
keywords: smallprint printgap noloewdin
keywords: NOSOSCF
formula: C18H14BrCl2N5O2
InChI: InChI=1/C18H14BrCl2N5O2/c1-9-6-10(20)7-11(17(27)22-2)15(9)24-18(28)13-8-14(19)25-26(13)16-12(21)4-3-5-23-16/h3-8,22,24H,1-2H3
42 atoms
Br -4.863585 -1.604588 0.637677
Cl 6.835044 -0.902344 0.447158
Cl -0.997652 2.88229 0.526938
O  0.665252 0.632849 -1.486263
O  1.115805 -1.229444 2.792356
N  0.943424 -1.009517 0.070348
N  -2.131575 0.58724 -1.030645
N  -3.392253 0.295399 -0.742002
N  2.610572 0.286173 3.517371
N  -2.163981 1.722106 -3.057379
C  2.345372 -0.970694 0.130938
C  3.12263 -1.193048 -1.01086
C  2.96328 -0.745996 1.369703
C  -1.253475 -0.297786 -0.495775
C  0.203859 -0.162869 -0.698532
C  4.507397 -1.146391 -0.890559
C  4.348553 -0.735499 1.467218
C  2.522451 -1.534755 -2.33955
C  5.11217 -0.91907 0.330475
C  -2.009367 -1.229809 0.175694
C  2.138574 -0.589491 2.609037
C  -1.863128 1.759259 -1.783237
C  -3.327178 -0.796174 -0.018837
C  -1.347316 2.886814 -1.153281
C  -1.115851 4.014731 -1.917388
C  -1.952397 2.804152 -3.789492
C  -1.423867 3.972641 -3.266624
C  1.909368 0.545244 4.7525
H  0.506836 -1.389511 0.901364
H  5.120062 -1.320588 -1.765386
H  4.834095 -0.61755 2.426697
H  3.23212 -2.099775 -2.942267
H  1.623538 -2.140425 -2.228415
H  2.245068 -0.638527 -2.892592
H  -1.680091 -2.102238 0.714213
H  3.337871 0.920609 3.238295
H  -0.707676 4.906224 -1.46215
H  -2.214371 2.73282 -4.83792
H  -1.257897 4.833732 -3.898486
H  2.563162 1.104762 5.416795
H  1.641046 -0.389186 5.239722
H  0.994894 1.119915 4.595559
totalener: -4613.29994148 hartree
nucrepener: 3385.12494266 hartree
electener: -7998.42488414 hartree
twoeener: 5115.74566337 hartree
kineticenergy: 4603.86219483 hartree
xcener: -219.228237632312 hartree
chargesum: 0.0000000
charge: 0.005301 -0.070367 -0.052255 -0.390235 -0.437845 -0.216222 0.176515 -0.245271 -0.206160 -0.275780 0.108762 0.000131 -0.023477 -0.068410 0.345785 -0.112599 -0.198838 -0.239424 0.091661 -0.170724 0.372642 0.179808 0.018954 0.048973 -0.101930 -0.000205 -0.091332 -0.151908 0.183661 0.102314 0.121453 0.088077 0.097797 0.127641 0.145337 0.147966 0.122385 0.120944 0.128987 0.095979 0.112317 0.109590
qa: 0.0053 -0.0704 -0.0523 -0.3902 -0.4378 -0.2162 0.1765 -0.2453 -0.2062 -0.2758 0.1088 0.0001 -0.0235 -0.0684 0.3458 -0.1126 -0.1988 -0.2394 0.0917 -0.1707 0.3726 0.1798 0.0190 0.0490 -0.1019 -0.0002 -0.0913 -0.1519 0.1837 0.1023 0.1215 0.0881 0.0978 0.1276 0.1453 0.1480 0.1224 0.1209 0.1290 0.0960 0.1123 0.1096
va: 1.2333 1.2358 1.2668 2.1073 2.0636 3.1948 3.3323 2.8697 3.2007 3.0960 3.8569 3.9068 3.7322 3.8787 4.1295 4.0226 4.0516 3.8698 3.9561 3.9664 4.0890 3.9810 4.2458 4.0119 4.0214 4.0661 3.8772 3.9160 1.0511 1.0223 1.0401 1.0051 1.0061 1.0044 1.0055 1.0226 1.0145 1.0005 0.9989 0.9991 1.0019 0.9912
dispcorr: -0.023663009 hartree
energy: -4613.323604491195
dipole: 56.34457 -54.71145 1.63313 16.77840 -15.54674 1.23166 -4.89838 5.36689 0.46851
magnitude: 2.09847 au
magnitude: 5.33389 debye
