program: Orca
programVersion: 5.0.2
elementType: Br Cl Cl O O N N N N N C C C C C C C C C C C C C C C C C C H H H H H H H H H H H H H H
charge: 0
multiplicity: 1
keywords: wb97x-d3
keywords: def2-TZVPP
keywords: def2/J RIJCOSX
keywords: DEFGRID2
keywords: scfconv7
keywords: smallprint printgap noloewdin
keywords: NOSOSCF
formula: C18H14BrCl2N5O2
InChI: InChI=1/C18H14BrCl2N5O2/c1-9-6-10(20)7-11(17(27)22-2)15(9)24-18(28)13-8-14(19)25-26(13)16-12(21)4-3-5-23-16/h3-8,22,24H,1-2H3
42 atoms
Br -4.602041 -0.217092 1.985604
Cl 6.860096 -1.083775 0.451404
Cl -0.855799 3.269079 -1.278001
O  0.610082 0.081306 -1.554934
O  1.148124 -1.516214 2.788393
N  1.111983 0.238993 0.661768
N  -2.132742 0.567201 -0.901605
N  -3.352491 0.481038 -0.385382
N  2.268387 -3.333908 2.069113
N  -2.458726 0.195221 -3.166194
C  2.481214 -0.07014 0.575324
C  3.349681 0.723804 -0.178246
C  2.968163 -1.175287 1.284653
C  -1.165047 0.224906 -0.015688
C  0.262953 0.175178 -0.398844
C  4.69695 0.378491 -0.215876
C  4.321658 -1.483357 1.253409
C  2.887993 1.947986 -0.906588
C  5.175469 -0.706901 0.492535
C  -1.810216 -0.11756 1.148814
C  2.038664 -2.007158 2.114347
C  -1.988593 0.997539 -2.24276
C  -3.166142 0.067488 0.843681
C  -1.410263 2.230074 -2.529049
C  -1.298012 2.609303 -3.853883
C  -2.365008 0.561804 -4.433498
C  -1.784032 1.755548 -4.829086
C  1.437333 -4.277201 2.778349
H  0.716505 0.142451 1.585899
H  5.383747 0.986963 -0.789581
H  4.715548 -2.304946 1.836681
H  2.075974 2.446752 -0.380084
H  3.706833 2.658152 -1.01417
H  2.521532 1.697732 -1.901343
H  -1.386244 -0.49149 2.066339
H  2.882885 -3.684714 1.35537
H  -0.847398 3.55748 -4.112215
H  -2.768458 -0.128858 -5.163636
H  -1.716164 2.015572 -5.876009
H  1.960946 -5.228275 2.846867
H  0.479812 -4.43953 2.279031
H  1.238933 -3.919225 3.785676
totalener: -4613.29960133 hartree
nucrepener: 3384.32796807 hartree
electener: -7997.62756940 hartree
twoeener: 5114.90317068 hartree
kineticenergy: 4603.86128414 hartree
xcener: -219.227455055764 hartree
chargesum: -0.0000000
charge: 0.004435 -0.069088 -0.052882 -0.375888 -0.449557 -0.211058 0.169764 -0.242409 -0.205989 -0.276101 0.135211 0.005077 -0.044565 -0.029654 0.298840 -0.104102 -0.195394 -0.243467 0.090970 -0.186224 0.374367 0.198556 0.009955 0.033228 -0.097022 0.004036 -0.095236 -0.155447 0.180681 0.102925 0.125615 0.086341 0.089731 0.124644 0.152311 0.150040 0.124961 0.121055 0.129673 0.098192 0.111350 0.112125
qa: 0.0044 -0.0691 -0.0529 -0.3759 -0.4496 -0.2111 0.1698 -0.2424 -0.2060 -0.2761 0.1352 0.0051 -0.0446 -0.0297 0.2988 -0.1041 -0.1954 -0.2435 0.0910 -0.1862 0.3744 0.1986 0.0100 0.0332 -0.0970 0.0040 -0.0952 -0.1554 0.1807 0.1029 0.1256 0.0863 0.0897 0.1246 0.1523 0.1500 0.1250 0.1211 0.1297 0.0982 0.1113 0.1121
va: 1.2333 1.2369 1.2657 2.1256 2.0505 3.1964 3.3427 2.8735 3.1939 3.0985 3.8162 3.8648 3.7562 3.8321 4.1809 4.0207 4.0525 3.8734 3.9556 3.9390 4.0901 3.9667 4.2604 4.0025 4.0088 4.0657 3.8803 3.9138 1.0433 1.0223 1.0368 1.0152 1.0083 1.0037 1.0103 1.0209 1.0137 1.0001 0.9989 0.9990 0.9902 1.0041
dispcorr: -0.024633667 hartree
energy: -4613.324234996438
dipole: 52.45309 -50.98651 1.46658 -7.29417 6.91439 -0.37978 -20.61442 19.93450 -0.67992
magnitude: 1.66053 au
magnitude: 4.22074 debye
