program: Orca
programVersion: 5.0.2
elementType: F F F O N N N C C C C C C C C C H H H H H H
charge: 0
multiplicity: 1
keywords: wb97x-d3
keywords: def2-TZVPP
keywords: def2/J RIJCOSX
keywords: DEFGRID2
keywords: scfconv7
keywords: smallprint printgap noloewdin
keywords: NOSOSCF
formula: C9H6F3N3O
InChI: InChI=1/C9H6F3N3O/c10-9(11,12)7-1-3-14-5-6(7)8(16)15-4-2-13/h1,3,5,15H,4H2
22 atoms
F  -1.808202 -2.277888 -0.833244
F  -0.300401 -1.997682 0.673326
F  -2.384403 -1.855878 1.194734
O  1.150974 0.4053 1.866008
N  1.835877 0.01242 -0.25978
N  -1.699123 2.609345 -0.684983
N  4.875742 1.500251 -0.76173
C  -1.502384 -0.093365 -0.057973
C  -0.411036 0.748044 0.107425
C  -1.487434 -1.566062 0.253183
C  0.920448 0.353225 0.684264
C  -2.686996 0.446575 -0.541661
C  -0.576844 2.093586 -0.222803
C  -2.733864 1.79674 -0.837773
C  3.194334 -0.318354 0.071837
C  4.138502 0.70449 -0.383336
H  -3.566352 -0.165949 -0.687819
H  0.253757 2.78083 -0.098576
H  1.568486 0.024452 -1.229531
H  -3.647238 2.241145 -1.214808
H  3.480039 -1.276637 -0.366627
H  3.271437 -0.419275 1.154385
totalener: -885.67760216 hartree
nucrepener: 1095.18001443 hartree
electener: -1980.85761659 hartree
oneelecener: -3387.77546061 hartree
twoeener: 1406.91784402 hartree
kineticenergy: 882.47521022 hartree
xcener: -78.217723029460 hartree
chargesum: 0.0000000
charge: -0.167173 -0.159887 -0.158604 -0.347366 -0.195095 -0.272030 -0.013400 -0.135485 0.013836 0.528850 0.334795 -0.077773 -0.005888 0.014729 0.098543 -0.242057 0.124351 0.119461 0.152846 0.126834 0.130926 0.129587
qa: -0.1672 -0.1599 -0.1586 -0.3474 -0.1951 -0.2720 -0.0134 -0.1355 0.0138 0.5288 0.3348 -0.0778 -0.0059 0.0147 0.0985 -0.2421 0.1244 0.1195 0.1528 0.1268 0.1309 0.1296
va: 1.1361 1.1437 1.1517 2.1626 3.1544 3.0964 3.1076 3.8990 3.6282 4.4699 4.1479 3.9161 4.1044 4.0245 3.8271 3.9490 1.0116 1.0119 1.0213 0.9994 0.9942 1.0296
dispcorr: -0.008918329 hartree
energy: -885.686520491050
dipole: 5.59822 -6.59047 -0.99225 8.68517 -9.70139 -1.01622 -3.38359 2.49082 -0.89276
magnitude: 1.67759 au
magnitude: 4.26409 debye
