program: Orca
programVersion: 5.0.2
elementType: Cl Cl F F F F O O O O N N N C C C C C C C C C C C C C C C C C C C C C C C H H H H H H H H H H H H H H H H H H H
charge: 0
multiplicity: 1
keywords: wb97x-d3
keywords: def2-TZVPP
keywords: def2/J RIJCOSX
keywords: DEFGRID2
keywords: scfconv7
keywords: smallprint printgap noloewdin
keywords: NOSOSCF
formula: C23H19Cl2F4N3O4
InChI: InChI=1/C23H19Cl2F4N3O4/c1-3-32-21(34)18(10-35-32)30-20(33)14-5-4-12(6-11(14)2)17-9-22(36-31-17,23(27,28)29)13-7-15(24)19(26)16(25)8-13/h4-8,18,30H,3,9-10H2,1-2H3
55 atoms
Cl -5.965605 -1.775751 2.178989
Cl -6.880305 0.065585 -2.746804
F  -2.244835 3.960219 0.89526
F  -4.255268 3.726586 0.170254
F  -3.680277 2.845382 2.047611
F  -7.333778 -1.51554 -0.362008
O  -2.421695 2.267164 -1.219987
O  8.40006 -2.59235 -0.534503
O  5.806929 -3.668603 1.461449
O  5.870007 1.061551 0.019611
N  -1.067557 2.096979 -1.369752
N  5.255932 -1.088316 0.275648
N  7.613994 -3.567918 0.069298
C  -2.850629 1.823455 0.068474
C  -1.607852 1.172342 0.686779
C  -0.583006 1.51561 -0.34503
C  -4.047307 0.907731 -0.067921
C  -3.262893 3.103185 0.807774
C  0.837924 1.192642 -0.24406
C  6.595276 -1.557682 0.490413
C  -4.814319 0.918553 -1.225798
C  -4.397585 0.078192 0.990546
C  7.524578 -1.477478 -0.713328
C  1.73917 1.597159 -1.231017
C  3.541789 0.548435 -0.060784
C  3.090835 1.297837 -1.158013
C  1.306471 0.461385 0.842086
C  6.598944 -3.051831 0.765544
C  2.649951 0.134717 0.92098
C  4.989192 0.210995 0.081286
C  -5.508967 -0.738377 0.887677
C  -5.91985 0.090837 -1.32185
C  8.237233 -4.859236 0.210628
C  -6.270774 -0.730743 -0.266899
C  4.007504 1.759209 -2.252495
C  9.426878 -4.853631 1.153674
H  -1.710555 0.088766 0.771778
H  -1.347035 1.544893 1.677931
H  7.043606 -1.061053 1.359083
H  -4.561782 1.553963 -2.062641
H  -3.808085 0.046828 1.897205
H  6.960823 -1.577835 -1.646173
H  8.143809 -0.585369 -0.747692
H  1.380495 2.15945 -2.083884
H  0.636888 0.133693 1.626158
H  4.495407 -1.750638 0.331097
H  3.002558 -0.436399 1.77042
H  7.46095 -5.532245 0.571159
H  8.523197 -5.209396 -0.781572
H  3.432333 2.089728 -3.114898
H  4.625978 2.59661 -1.931306
H  4.678405 0.96841 -2.586668
H  9.823879 -5.864823 1.237295
H  9.137778 -4.520758 2.150583
H  10.229736 -4.211937 0.792748
elementType: Cl F O N C H
totalener: -2672.99758544 hartree
nucrepener: 4071.06998088 hartree
electener: -6744.06756632 hartree
twoeener: 5027.90342181 hartree
cpcmener: -0.05748457 hartree
kineticenergy: 2664.88785210 hartree
xcener: -201.534465535743 hartree
chargesum: 0.0000000
charge: -0.055928 -0.057858 -0.173817 -0.171293 -0.173294 -0.186534 -0.245498 -0.283078 -0.543241 -0.544538 -0.127409 -0.187224 0.033870 0.248467 -0.068158 0.198888 -0.011868 0.473784 -0.080178 0.085571 -0.161987 -0.170975 0.028784 -0.116962 0.073118 -0.065795 -0.166363 0.291640 -0.193937 0.369325 0.029471 0.039073 -0.016301 0.191939 -0.261157 -0.247048 0.131937 0.124241 0.114863 0.131237 0.141187 0.090587 0.110490 0.128837 0.149931 0.180189 0.151485 0.090804 0.109282 0.098197 0.105886 0.111186 0.096186 0.089379 0.090608
qa: -0.0559 -0.0579 -0.1738 -0.1713 -0.1733 -0.1865 -0.2455 -0.2831 -0.5432 -0.5445 -0.1274 -0.1872 0.0339 0.2485 -0.0682 0.1989 -0.0119 0.4738 -0.0802 0.0856 -0.1620 -0.1710 0.0288 -0.1170 0.0731 -0.0658 -0.1664 0.2916 -0.1939 0.3693 0.0295 0.0391 -0.0163 0.1919 -0.2612 -0.2470 0.1319 0.1242 0.1149 0.1312 0.1412 0.0906 0.1105 0.1288 0.1499 0.1802 0.1515 0.0908 0.1093 0.0982 0.1059 0.1112 0.0962 0.0894 0.0906
va: 1.2461 1.2422 1.1400 1.1415 1.1394 1.1311 1.9847 1.8904 1.9683 1.9608 2.9788 3.2276 3.1711 3.8921 3.9110 3.8520 3.8199 4.4867 3.8014 3.8564 4.0910 4.0738 3.9336 3.9460 3.5876 3.8621 3.9734 4.2266 4.0246 4.1106 3.8811 3.8658 3.8815 4.1647 3.9288 3.9166 1.0064 1.0194 1.0176 1.0404 1.0219 1.0065 1.0046 1.0357 1.0029 1.0196 1.0151 1.0158 1.0009 1.0048 1.0035 0.9950 1.0060 1.0036 1.0082
dispcorr: -0.028895382 hartree
energy: -2673.026480823958
dipole: 107.23792 -105.35853 1.87938 -24.53125 22.53164 -1.99961 -2.53609 3.02330 0.48722
magnitude: 2.78710 au
magnitude: 7.08423 debye
