program: Orca
programVersion: 5.0.2
elementType: Cl Cl F F F F O O O O N N N C C C C C C C C C C C C C C C C C C C C C C C H H H H H H H H H H H H H H H H H H H
charge: 0
multiplicity: 1
keywords: wb97x-d3
keywords: def2-TZVPP
keywords: def2/J RIJCOSX
keywords: DEFGRID2
keywords: scfconv7
keywords: smallprint printgap noloewdin
keywords: NOSOSCF
formula: C23H19Cl2F4N3O4
InChI: InChI=1/C23H19Cl2F4N3O4/c1-3-32-21(34)18(10-35-32)30-20(33)14-5-4-12(6-11(14)2)17-9-22(36-31-17,23(27,28)29)13-7-15(24)19(26)16(25)8-13/h4-8,18,30H,3,9-10H2,1-2H3
55 atoms
Cl -6.264252 -0.15325 3.255009
Cl -7.459396 -0.875676 -1.895753
F  -3.388938 3.225882 0.627494
F  -1.883497 3.290573 -0.91603
F  -3.956698 3.077022 -1.444551
F  -7.871661 -0.923799 0.971591
O  -2.538557 0.78466 -1.80334
O  8.685416 -2.218225 0.647877
O  7.192983 -0.283987 -1.78999
O  5.539348 -0.116688 0.809476
N  -1.218169 0.411274 -1.8589
N  5.257854 -1.987309 -0.415654
N  8.652673 -1.192872 -0.292443
C  -2.890514 1.192088 -0.481086
C  -1.689859 0.786073 0.37942
C  -0.71333 0.417373 -0.6891
C  -4.216932 0.583284 -0.090697
C  -3.033256 2.71642 -0.552876
C  0.685177 0.061653 -0.467711
C  6.652503 -2.304194 -0.496856
C  -5.10895 0.17059 -1.0721
C  -4.565374 0.488265 1.250885
C  7.339819 -2.681868 0.809779
C  1.203377 0.046107 0.823932
C  3.353274 -0.588557 -0.005367
C  2.535371 -0.26652 1.081613
C  1.518488 -0.25995 -1.538575
C  7.497199 -1.121118 -0.955459
C  2.836051 -0.588733 -1.300445
C  4.8065 -0.868737 0.17713
C  -5.801062 -0.022994 1.605713
C  -6.339137 -0.346072 -0.706036
C  9.617433 -0.140383 -0.086306
C  -6.687976 -0.437798 0.628609
C  3.028084 -0.257881 2.498635
C  9.297653 0.727015 1.117218
H  -1.905862 -0.077967 1.011127
H  -1.322332 1.574812 1.036598
H  6.75848 -3.102368 -1.234748
H  -4.862935 0.23634 -2.1222
H  -3.883218 0.799376 2.031059
H  6.873971 -2.201539 1.67228
H  7.382527 -3.755377 0.978707
H  0.563309 0.283024 1.665185
H  1.145479 -0.251351 -2.553097
H  4.614865 -2.565454 -0.933771
H  3.476699 -0.824082 -2.14057
H  10.60543 -0.592325 0.003066
H  9.62728 0.45078 -1.000727
H  2.189101 -0.295883 3.191529
H  3.676367 -1.105985 2.71716
H  3.591778 0.649263 2.719003
H  9.287917 0.148891 2.040532
H  8.33043 1.216712 1.004418
H  10.057012 1.502028 1.218395
elementType: Cl F O N C H
totalener: -2672.99658483 hartree
nucrepener: 4116.22256658 hartree
electener: -6789.21915141 hartree
twoeener: 5074.40237730 hartree
cpcmener: -0.06745186 hartree
kineticenergy: 2664.91423376 hartree
xcener: -201.542860658631 hartree
chargesum: 0.0000000
charge: -0.055839 -0.057767 -0.172791 -0.173916 -0.170515 -0.186408 -0.244971 -0.296817 -0.544648 -0.541950 -0.124864 -0.191393 0.036540 0.246340 -0.076074 0.185567 -0.007608 0.473605 -0.075005 0.161655 -0.164717 -0.167391 -0.008747 -0.111899 0.052933 -0.066051 -0.176236 0.242494 -0.187028 0.388504 0.029802 0.040888 -0.001289 0.189333 -0.262640 -0.258401 0.133559 0.124482 0.120600 0.131266 0.141722 0.101805 0.112962 0.134638 0.147419 0.187265 0.147922 0.107991 0.092130 0.099673 0.109661 0.106006 0.089963 0.086636 0.101607
qa: -0.0558 -0.0578 -0.1728 -0.1739 -0.1705 -0.1864 -0.2450 -0.2968 -0.5446 -0.5420 -0.1249 -0.1914 0.0365 0.2463 -0.0761 0.1856 -0.0076 0.4736 -0.0750 0.1617 -0.1647 -0.1674 -0.0087 -0.1119 0.0529 -0.0661 -0.1762 0.2425 -0.1870 0.3885 0.0298 0.0409 -0.0013 0.1893 -0.2626 -0.2584 0.1336 0.1245 0.1206 0.1313 0.1417 0.1018 0.1130 0.1346 0.1474 0.1873 0.1479 0.1080 0.0921 0.0997 0.1097 0.1060 0.0900 0.0866 0.1016
va: 1.2462 1.2427 1.1404 1.1390 1.1433 1.1315 1.9831 1.8786 1.9603 1.9451 2.9767 3.2572 3.1431 3.8989 3.9154 3.8608 3.8185 4.4853 3.8327 3.7777 4.0948 4.0685 3.9750 3.9219 3.6035 3.8534 4.0176 4.2434 4.0082 4.1014 3.8845 3.8648 3.8752 4.1675 3.9340 3.9231 1.0072 1.0196 1.0074 1.0409 1.0217 1.0120 0.9938 1.0085 1.0256 1.0003 1.0212 0.9999 1.0182 1.0041 0.9961 1.0021 1.0065 1.0090 1.0079
dispcorr: -0.030077009 hartree
energy: -2673.026661837785
dipole: 106.58444 -105.45628 1.12816 -14.53055 11.88853 -2.64201 9.47887 -7.38234 2.09653
magnitude: 3.55646 au
magnitude: 9.03981 debye
