program: Orca
programVersion: 5.0.2
elementType: Cl Cl F F F F O O O O N N N C C C C C C C C C C C C C C C C C C C C C C C H H H H H H H H H H H H H H H H H H H
charge: 0
multiplicity: 1
keywords: wb97x-d3
keywords: def2-TZVPP
keywords: def2/J RIJCOSX
keywords: DEFGRID2
keywords: scfconv7
keywords: smallprint printgap noloewdin
keywords: NOSOSCF
formula: C23H19Cl2F4N3O4
InChI: InChI=1/C23H19Cl2F4N3O4/c1-3-32-21(34)18(10-35-32)30-20(33)14-5-4-12(6-11(14)2)17-9-22(36-31-17,23(27,28)29)13-7-15(24)19(26)16(25)8-13/h4-8,18,30H,3,9-10H2,1-2H3
55 atoms
Cl -6.953512 -0.947584 -2.144938
Cl -5.677145 -0.820636 3.035895
F  -3.61078 3.462649 1.052074
F  -2.306765 4.112202 -0.533722
F  -4.341308 3.576754 -0.971521
F  -7.189967 -1.556912 0.678426
O  -2.509801 1.737803 -1.849593
O  8.558868 -2.459623 -0.292923
O  6.091022 -2.875838 2.080422
O  5.82494 1.065323 -0.874934
N  -1.16527 1.511816 -2.013141
N  5.372555 -0.869778 0.181205
N  7.938651 -3.119585 0.75932
C  -2.850259 1.806055 -0.463515
C  -1.548016 1.471891 0.273248
C  -0.602656 1.372911 -0.878611
C  -4.009674 0.879114 -0.167215
C  -3.283251 3.257391 -0.225317
C  0.827876 1.103508 -0.756951
C  6.749604 -1.199067 0.411872
C  -4.262533 0.494225 1.143818
C  -4.842884 0.446831 -1.190917
C  7.570143 -1.566385 -0.815611
C  1.387832 0.928489 0.5043
C  3.541744 0.551544 -0.460687
C  2.740472 0.6459 0.679644
C  1.650004 1.021739 -1.882334
C  6.856125 -2.490104 1.208593
C  2.995513 0.763225 -1.725931
C  5.011194 0.286009 -0.39194
C  -5.91268 -0.381976 -0.899862
C  -5.339584 -0.32664 1.425153
C  8.427796 -4.441456 1.054693
C  -6.163386 -0.765697 0.4046
C  3.280466 0.478375 2.070945
C  8.11148 -5.448867 -0.034606
H  -1.604299 0.520709 0.80507
H  -1.236194 2.22229 1.001076
H  7.243718 -0.402914 0.981616
H  -3.622524 0.813094 1.95579
H  -4.668741 0.733679 -2.218046
H  6.949626 -2.075506 -1.560192
H  8.096039 -0.734096 -1.275426
H  0.767409 1.01635 1.387633
H  1.244558 1.164328 -2.874502
H  4.663923 -1.472757 0.574983
H  3.629482 0.705331 -2.601321
H  9.502321 -4.381727 1.233879
H  7.966858 -4.731105 1.997789
H  4.243558 0.971369 2.20073
H  2.592022 0.903336 2.79939
H  3.413286 -0.573164 2.331348
H  8.572811 -5.177447 -0.983291
H  7.036087 -5.541337 -0.184521
H  8.49825 -6.425687 0.254002
elementType: Cl F O N C H
totalener: -2672.99628466 hartree
nucrepener: 4085.85413370 hartree
electener: -6758.85041835 hartree
twoeener: 5042.43846961 hartree
cpcmener: -0.05868274 hartree
kineticenergy: 2664.87778129 hartree
xcener: -201.533727206288 hartree
chargesum: 0.0000000
charge: -0.058563 -0.056163 -0.173827 -0.174175 -0.170832 -0.186733 -0.245809 -0.287088 -0.548815 -0.546826 -0.125323 -0.198623 0.038829 0.256690 -0.076878 0.205260 -0.017509 0.474223 -0.081786 0.107667 -0.171238 -0.162436 0.020312 -0.107356 0.079407 -0.087110 -0.186375 0.278474 -0.174888 0.377997 0.041980 0.028859 -0.010355 0.192381 -0.268352 -0.244910 0.131446 0.122153 0.114661 0.142690 0.130184 0.097096 0.112948 0.132310 0.147932 0.182739 0.148404 0.108287 0.092412 0.113848 0.101449 0.105677 0.089104 0.088409 0.098143
qa: -0.0586 -0.0562 -0.1738 -0.1742 -0.1708 -0.1867 -0.2458 -0.2871 -0.5488 -0.5468 -0.1253 -0.1986 0.0388 0.2567 -0.0769 0.2053 -0.0175 0.4742 -0.0818 0.1077 -0.1712 -0.1624 0.0203 -0.1074 0.0794 -0.0871 -0.1864 0.2785 -0.1749 0.3780 0.0420 0.0289 -0.0104 0.1924 -0.2684 -0.2449 0.1314 0.1222 0.1147 0.1427 0.1302 0.0971 0.1129 0.1323 0.1479 0.1827 0.1484 0.1083 0.0924 0.1138 0.1014 0.1057 0.0891 0.0884 0.0981
va: 1.2416 1.2459 1.1387 1.1398 1.1422 1.1310 1.9830 1.8832 1.9603 1.9596 2.9808 3.2340 3.2073 3.8862 3.9157 3.8543 3.8227 4.4862 3.8109 3.7989 4.0719 4.0929 3.9382 3.9173 3.5966 3.8828 4.0047 4.2619 4.0104 4.1018 3.8636 3.8839 3.8795 4.1642 3.9479 3.9159 1.0070 1.0209 1.0182 1.0213 1.0410 1.0063 1.0057 1.0092 1.0237 1.0169 1.0112 0.9981 1.0170 0.9940 1.0052 0.9998 1.0087 1.0045 1.0068
dispcorr: -0.029336014 hartree
energy: -2673.025620670310
dipole: 102.28559 -100.42383 1.86176 -27.81946 26.03790 -1.78156 3.97609 -2.56106 1.41503
magnitude: 2.93980 au
magnitude: 7.47238 debye
