program: Orca
programVersion: 5.0.2
elementType: Cl Cl F F F F O O O O N N N C C C C C C C C C C C C C C C C C C C C C C C H H H H H H H H H H H H H H H H H H H
charge: 0
multiplicity: 1
keywords: wb97x-d3
keywords: def2-TZVPP
keywords: def2/J RIJCOSX
keywords: DEFGRID2
keywords: scfconv7
keywords: smallprint printgap noloewdin
keywords: NOSOSCF
formula: C23H19Cl2F4N3O4
InChI: InChI=1/C23H19Cl2F4N3O4/c1-3-32-21(34)18(10-35-32)30-20(33)14-5-4-12(6-11(14)2)17-9-22(36-31-17,23(27,28)29)13-7-15(24)19(26)16(25)8-13/h4-8,18,30H,3,9-10H2,1-2H3
55 atoms
Cl -7.105327 -0.668344 -2.145321
Cl -5.791461 -0.707029 3.028551
F  -4.264521 3.704964 -0.899853
F  -3.52414 3.521535 1.11481
F  -2.200086 4.125055 -0.472799
F  -7.353862 -1.322664 0.669943
O  -2.540634 1.798846 -1.829086
O  8.430518 -2.627408 -0.571614
O  5.956111 -3.291922 1.729089
O  5.786281 0.948219 -0.843044
N  -1.199562 1.558629 -2.007117
N  5.275263 -1.049868 0.06106
N  7.704508 -3.468936 0.267326
C  -2.866242 1.851341 -0.438865
C  -1.577889 1.433043 0.276691
C  -0.636502 1.366897 -0.88055
C  -4.068389 0.978898 -0.152496
C  -3.218837 3.318747 -0.168228
C  0.788305 1.067562 -0.771024
C  6.639715 -1.43911 0.276244
C  -4.329656 0.579355 1.152696
C  -4.92711 0.60625 -1.178152
C  7.494926 -1.624075 -0.968445
C  1.342312 0.834104 0.483454
C  3.48794 0.45279 -0.49411
C  2.688339 0.518778 0.648562
C  1.609253 1.011828 -1.89864
C  6.702145 -2.831535 0.878996
C  2.949468 0.721692 -1.751346
C  4.950414 0.153873 -0.427193
C  -6.033119 -0.177064 -0.895461
C  -5.441531 -0.196747 1.425606
C  8.39789 -4.658991 0.691229
C  -6.292726 -0.575353 0.403019
C  3.225806 0.28098 2.030266
C  9.596391 -4.373091 1.577633
H  -1.666583 0.453453 0.750038
H  -1.242836 2.127705 1.048215
H  7.131728 -0.755471 0.979611
H  -3.668553 0.850868 1.96494
H  -4.746806 0.905823 -2.200655
H  6.888937 -1.973776 -1.810576
H  8.067408 -0.747983 -1.259722
H  0.721608 0.897838 1.368534
H  1.207075 1.197774 -2.884999
H  4.54517 -1.656317 0.408178
H  3.584452 0.684626 -2.627186
H  7.663386 -5.266263 1.217955
H  8.689923 -5.217712 -0.198169
H  2.545963 0.685593 2.778244
H  3.34049 -0.783531 2.242351
H  4.1981 0.750243 2.17987
H  10.040623 -5.316057 1.8949
H  9.303244 -3.821667 2.471022
H  10.364469 -3.804812 1.054895
elementType: Cl F O N C H
totalener: -2672.99663357 hartree
nucrepener: 4080.32311408 hartree
electener: -6753.31974765 hartree
twoeener: 5036.95857455 hartree
cpcmener: -0.05840672 hartree
kineticenergy: 2664.89140390 hartree
xcener: -201.533856530603 hartree
chargesum: -0.0000000
charge: -0.058430 -0.056100 -0.171016 -0.173870 -0.174373 -0.186794 -0.245873 -0.282450 -0.539429 -0.546769 -0.124934 -0.189998 0.029620 0.253859 -0.074768 0.201052 -0.012954 0.473444 -0.081414 0.088840 -0.170632 -0.162777 0.025293 -0.106899 0.077805 -0.086197 -0.183810 0.292492 -0.176079 0.372851 0.041357 0.028545 -0.016164 0.191810 -0.267492 -0.248761 0.132698 0.121486 0.117443 0.143075 0.130713 0.093235 0.110898 0.131994 0.148051 0.182643 0.148949 0.091194 0.109564 0.101554 0.106238 0.113575 0.096576 0.090510 0.090620
qa: -0.0584 -0.0561 -0.1710 -0.1739 -0.1744 -0.1868 -0.2459 -0.2825 -0.5394 -0.5468 -0.1249 -0.1900 0.0296 0.2539 -0.0748 0.2011 -0.0130 0.4734 -0.0814 0.0888 -0.1706 -0.1628 0.0253 -0.1069 0.0778 -0.0862 -0.1838 0.2925 -0.1761 0.3729 0.0414 0.0285 -0.0162 0.1918 -0.2675 -0.2488 0.1327 0.1215 0.1174 0.1431 0.1307 0.0932 0.1109 0.1320 0.1481 0.1826 0.1489 0.0912 0.1096 0.1016 0.1062 0.1136 0.0966 0.0905 0.0906
va: 1.2417 1.2459 1.1418 1.1391 1.1394 1.1309 1.9823 1.8927 1.9693 1.9597 2.9795 3.2285 3.1799 3.8907 3.9133 3.8590 3.8164 4.4870 3.8106 3.8312 4.0707 4.0916 3.9435 3.9174 3.6008 3.8839 3.9989 4.2307 4.0089 4.1053 3.8630 3.8834 3.8817 4.1642 3.9472 3.9174 1.0066 1.0207 1.0172 1.0212 1.0407 1.0052 1.0059 1.0093 1.0234 1.0161 1.0102 1.0151 1.0012 1.0050 0.9990 0.9943 1.0060 1.0031 1.0082
dispcorr: -0.029276590 hartree
energy: -2673.025910161918
dipole: 106.25000 -104.26821 1.98179 -27.43749 25.75975 -1.67775 7.22637 -5.66967 1.55669
magnitude: 3.02748 au
magnitude: 7.69523 debye
