program: Orca
programVersion: 5.0.2
elementType: Cl Cl F F F F O O O O N N N C C C C C C C C C C C C C C C C C C C C C C C H H H H H H H H H H H H H H H H H H H
charge: 0
multiplicity: 1
keywords: wb97x-d3
keywords: def2-TZVPP
keywords: def2/J RIJCOSX
keywords: DEFGRID2
keywords: scfconv7
keywords: smallprint printgap noloewdin
keywords: NOSOSCF
formula: C23H19Cl2F4N3O4
InChI: InChI=1/C23H19Cl2F4N3O4/c1-3-32-21(34)18(10-35-32)30-20(33)14-5-4-12(6-11(14)2)17-9-22(36-31-17,23(27,28)29)13-7-15(24)19(26)16(25)8-13/h4-8,18,30H,3,9-10H2,1-2H3
55 atoms
Cl -7.150237 -0.835307 -2.016013
Cl -5.837461 -0.721474 3.157028
F  -4.142118 3.503974 -1.024121
F  -3.47777 3.408333 1.021501
F  -2.077692 3.864668 -0.551449
F  -7.407376 -1.395311 0.818771
O  -2.504512 1.473182 -1.786515
O  8.844101 -1.386356 0.337295
O  6.071509 -2.445565 2.099712
O  5.240861 -1.647048 -0.752576
N  -1.183599 1.130201 -1.933371
N  5.574852 0.062274 0.678853
N  8.102957 -2.305936 1.073254
C  -2.840624 1.625313 -0.405445
C  -1.575108 1.204804 0.35098
C  -0.638505 0.986198 -0.791074
C  -4.074758 0.810354 -0.080796
C  -3.138921 3.118826 -0.235385
C  0.763712 0.604104 -0.647931
C  6.882643 -0.357641 1.08587
C  -4.349938 0.46919 1.238154
C  -4.942553 0.420446 -1.092678
C  7.972127 -0.29472 0.021774
C  1.587468 0.457845 -1.765564
C  3.426582 -0.157821 -0.366864
C  2.913819 0.070477 -1.65225
C  1.292415 0.379068 0.618396
C  6.92711 -1.827225 1.487335
C  2.619542 0.00651 0.751752
C  4.82199 -0.649909 -0.175477
C  -6.066195 -0.326742 -0.783338
C  -5.477439 -0.274613 1.537291
C  8.451564 -3.688116 0.847022
C  -6.333968 -0.67515 0.527772
C  3.747674 -0.075055 -2.890832
C  8.044095 -4.180693 -0.529136
H  -1.715381 0.278798 0.911072
H  -1.201233 1.947285 1.057755
H  7.155483 0.24095 1.957745
H  -3.687377 0.75831 2.04322
H  -4.754848 0.675954 -2.125698
H  7.567599 -0.41052 -0.985817
H  8.562189 0.617857 0.0661
H  1.188089 0.651459 -2.753104
H  0.682734 0.486803 1.505401
H  5.181506 0.879039 1.11999
H  3.017589 -0.177472 1.741483
H  9.52361 -3.803267 1.007738
H  7.956704 -4.261929 1.629162
H  3.278536 0.441732 -3.726507
H  4.748561 0.337826 -2.765591
H  3.859711 -1.121831 -3.175815
H  6.965162 -4.115859 -0.668128
H  8.336009 -5.224428 -0.642949
H  8.530292 -3.612157 -1.321348
elementType: Cl F O N C H
totalener: -2672.99692773 hartree
nucrepener: 4120.35076084 hartree
electener: -6793.34768856 hartree
twoeener: 5078.54672283 hartree
cpcmener: -0.06749017 hartree
kineticenergy: 2664.89243725 hartree
xcener: -201.538436428217 hartree
chargesum: 0.0000000
charge: -0.058459 -0.056204 -0.171023 -0.173518 -0.174818 -0.186716 -0.245585 -0.297578 -0.542480 -0.541159 -0.127880 -0.189603 0.036824 0.254596 -0.070754 0.198209 -0.021072 0.474276 -0.078122 0.160370 -0.173249 -0.159411 -0.007878 -0.122544 0.058031 -0.062601 -0.166141 0.239031 -0.198155 0.388316 0.038999 0.033072 -0.000250 0.192842 -0.261023 -0.261603 0.130703 0.123262 0.120819 0.143260 0.130320 0.102088 0.112674 0.129414 0.149019 0.188834 0.147723 0.108244 0.092023 0.099502 0.109521 0.106499 0.086879 0.102202 0.090271
qa: -0.0585 -0.0562 -0.1710 -0.1735 -0.1748 -0.1867 -0.2456 -0.2976 -0.5425 -0.5412 -0.1279 -0.1896 0.0368 0.2546 -0.0708 0.1982 -0.0211 0.4743 -0.0781 0.1604 -0.1732 -0.1594 -0.0079 -0.1225 0.0580 -0.0626 -0.1661 0.2390 -0.1982 0.3883 0.0390 0.0331 -0.0003 0.1928 -0.2610 -0.2616 0.1307 0.1233 0.1208 0.1433 0.1303 0.1021 0.1127 0.1294 0.1490 0.1888 0.1477 0.1082 0.0920 0.0995 0.1095 0.1065 0.0869 0.1022 0.0903
va: 1.2418 1.2458 1.1426 1.1391 1.1387 1.1311 1.9848 1.8800 1.9625 1.9482 2.9823 3.2536 3.1356 3.8781 3.9160 3.8507 3.8346 4.4904 3.8123 3.7792 4.0710 4.0922 3.9760 3.9517 3.5913 3.8542 3.9786 4.2478 4.0323 4.0981 3.8646 3.8758 3.8732 4.1640 3.9376 3.9242 1.0069 1.0202 1.0072 1.0205 1.0410 1.0106 0.9937 1.0356 1.0034 0.9991 1.0203 0.9999 1.0187 1.0038 0.9960 1.0018 1.0093 1.0083 1.0065
dispcorr: -0.030127818 hartree
energy: -2673.027055545188
dipole: 104.40468 -101.88641 2.51827 -21.11729 23.17253 2.05524 -6.60247 7.99289 1.39042
magnitude: 3.53538 au
magnitude: 8.98623 debye
