program: Orca
programVersion: 5.0.2
elementType: Cl Cl F F F F O O O O N N N C C C C C C C C C C C C C C C C C C C C C C C H H H H H H H H H H H H H H H H H H H
charge: 0
multiplicity: 1
keywords: wb97x-d3
keywords: def2-TZVPP
keywords: def2/J RIJCOSX
keywords: DEFGRID2
keywords: scfconv7
keywords: smallprint printgap noloewdin
keywords: NOSOSCF
formula: C23H19Cl2F4N3O4
InChI: InChI=1/C23H19Cl2F4N3O4/c1-3-32-21(34)18(10-35-32)30-20(33)14-5-4-12(6-11(14)2)17-9-22(36-31-17,23(27,28)29)13-7-15(24)19(26)16(25)8-13/h4-8,18,30H,3,9-10H2,1-2H3
55 atoms
Cl -5.964145 3.028795 2.809912
Cl -7.276563 -1.684668 0.680367
F  -2.355822 1.73505 -3.00856
F  -4.4526 1.364958 -2.71085
F  -3.508048 3.031483 -1.730489
F  -7.54023 0.63772 2.395486
O  -2.741652 -0.423193 -1.465988
O  9.067085 -0.441699 -0.619192
O  6.948286 -3.137865 -0.27926
O  4.938258 -0.258328 2.231472
N  -1.445196 -0.807129 -1.227233
N  5.565305 -0.569276 0.077418
N  8.645787 -1.740459 -0.897554
C  -3.006994 0.862426 -0.902615
C  -1.695788 1.263463 -0.213022
C  -0.84112 0.08618 -0.549268
C  -4.212743 0.7826 0.012175
C  -3.334188 1.761589 -2.101854
C  0.556229 -0.066136 -0.148889
C  6.964454 -0.751536 0.313186
C  -5.078399 -0.300611 -0.069495
C  -4.477866 1.816919 0.902247
C  7.86662 0.281426 -0.347493
C  1.281706 -1.209236 -0.48458
C  3.231134 -0.329571 0.587757
C  2.615899 -1.363521 -0.13222
C  1.180426 0.939505 0.583668
C  7.489417 -2.042993 -0.301085
C  2.50437 0.795697 0.958596
C  4.652224 -0.398113 1.049152
C  -5.604231 1.764041 1.703761
C  -6.196377 -0.348935 0.745327
C  9.682592 -2.631183 -1.35246
C  -6.464272 0.683727 1.624287
C  3.331834 -2.627563 -0.515062
C  10.746824 -2.906764 -0.305291
H  -1.811043 1.365835 0.867011
H  -1.261436 2.19726 -0.574114
H  7.142065 -0.79795 1.390005
H  -4.89539 -1.118074 -0.75178
H  -3.81306 2.665627 0.994483
H  7.42396 0.65067 -1.278184
H  8.126242 1.120262 0.293587
H  0.798217 -2.010206 -1.029471
H  0.645876 1.835055 0.871057
H  5.246679 -0.642379 -0.87893
H  2.978663 1.581052 1.532666
H  9.181482 -3.552558 -1.645279
H  10.121805 -2.209404 -2.256904
H  3.975752 -2.99647 0.282426
H  2.611934 -3.410774 -0.747862
H  3.952146 -2.489402 -1.402442
H  11.284061 -2.002992 -0.020501
H  11.474265 -3.610222 -0.709336
H  10.312283 -3.349176 0.591069
elementType: Cl F O N C H
totalener: -2672.99667627 hartree
nucrepener: 4067.25927203 hartree
electener: -6740.25594831 hartree
twoeener: 5024.35568673 hartree
cpcmener: -0.06446412 hartree
kineticenergy: 2664.86275065 hartree
xcener: -201.530351320710 hartree
chargesum: 0.0000000
charge: -0.056442 -0.058136 -0.174400 -0.170800 -0.173798 -0.186489 -0.246486 -0.284615 -0.545133 -0.540923 -0.129398 -0.192789 0.032312 0.249512 -0.063938 0.210306 -0.026833 0.475267 -0.079629 0.117565 -0.151294 -0.169964 0.028952 -0.126406 0.055402 -0.054646 -0.174397 0.291350 -0.187660 0.386208 0.026551 0.035771 -0.016311 0.197282 -0.286915 -0.247439 0.129594 0.121428 0.101447 0.130755 0.140600 0.092567 0.112226 0.127764 0.148770 0.188142 0.147298 0.090454 0.108446 0.107373 0.103486 0.111789 0.090232 0.096010 0.089981
qa: -0.0564 -0.0581 -0.1744 -0.1708 -0.1738 -0.1865 -0.2465 -0.2846 -0.5451 -0.5409 -0.1294 -0.1928 0.0323 0.2495 -0.0639 0.2103 -0.0268 0.4753 -0.0796 0.1176 -0.1513 -0.1700 0.0290 -0.1264 0.0554 -0.0546 -0.1744 0.2913 -0.1877 0.3862 0.0266 0.0358 -0.0163 0.1973 -0.2869 -0.2474 0.1296 0.1214 0.1014 0.1308 0.1406 0.0926 0.1122 0.1278 0.1488 0.1881 0.1473 0.0905 0.1084 0.1074 0.1035 0.1118 0.0902 0.0960 0.0900
va: 1.2453 1.2421 1.1407 1.1406 1.1382 1.1309 1.9818 1.8859 1.9633 1.9629 2.9811 3.2305 3.1686 3.8924 3.9090 3.8422 3.8182 4.4813 3.7969 3.7866 4.0744 4.0812 3.9832 3.9629 3.6057 3.8339 3.9692 4.2358 4.0413 4.1213 3.8833 3.8661 3.8805 4.1584 3.9413 3.9156 1.0072 1.0211 1.0470 1.0411 1.0221 1.0054 0.9953 1.0367 1.0033 1.0004 1.0130 1.0157 1.0013 1.0035 1.0076 0.9931 1.0084 1.0060 1.0033
dispcorr: -0.029315047 hartree
energy: -2673.025991320414
dipole: 112.98426 -110.11210 2.87216 -23.89740 25.90978 2.01238 -4.31784 3.01900 -1.29884
magnitude: 3.73978 au
magnitude: 9.50576 debye
