program: Orca
programVersion: 5.0.2
elementType: Cl Cl F F F F O O O O N N N C C C C C C C C C C C C C C C C C C C C C C C H H H H H H H H H H H H H H H H H H H
charge: 0
multiplicity: 1
keywords: wb97x-d3
keywords: def2-TZVPP
keywords: def2/J RIJCOSX
keywords: DEFGRID2
keywords: scfconv7
keywords: smallprint printgap noloewdin
keywords: NOSOSCF
formula: C23H19Cl2F4N3O4
InChI: InChI=1/C23H19Cl2F4N3O4/c1-3-32-21(34)18(10-35-32)30-20(33)14-5-4-12(6-11(14)2)17-9-22(36-31-17,23(27,28)29)13-7-15(24)19(26)16(25)8-13/h4-8,18,30H,3,9-10H2,1-2H3
55 atoms
Cl -7.245004 -0.893082 -2.256452
Cl -6.003491 -0.672706 2.931117
F  -3.602892 3.395994 0.655391
F  -2.099503 3.749047 -0.848065
F  -4.137763 3.399431 -1.428959
F  -7.549236 -1.382418 0.586733
O  -2.537645 1.307735 -2.004395
O  8.648323 -2.17122 -0.447673
O  6.928891 -0.696642 2.149921
O  4.860869 -2.146241 0.343813
N  -1.226861 0.908651 -2.091428
N  5.638881 -0.194339 -0.470567
N  8.222103 -2.083375 0.878427
C  -2.914529 1.53191 -0.643389
C  -1.682615 1.120963 0.172582
C  -0.722005 0.806484 -0.926367
C  -4.171925 0.752691 -0.317553
C  -3.192198 3.037147 -0.561071
C  0.660342 0.3781 -0.72628
C  7.022409 -0.523097 -0.302537
C  -4.474748 0.452935 1.005351
C  -5.030431 0.349953 -1.332309
C  7.591307 -1.600183 -1.218866
C  1.08448 -0.010189 0.542191
C  3.266299 -0.502522 -0.29957
C  2.376896 -0.466883 0.778276
C  1.565592 0.343042 -1.78581
C  7.355763 -1.084355 1.0738
C  2.860176 -0.083551 -1.564159
C  4.65008 -1.028355 -0.111133
C  -6.171282 -0.369913 -1.020826
C  -5.616302 -0.268011 1.306425
C  9.101634 -2.698606 1.838546
C  -6.463205 -0.682087 0.294359
C  2.773165 -0.883986 2.163783
C  10.459679 -2.026748 1.936915
H  -1.86823 0.235403 0.782314
H  -1.303033 1.892488 0.844225
H  7.589156 0.40498 -0.410847
H  -3.822246 0.755853 1.813396
H  -4.821922 0.5737 -2.368777
H  6.844855 -2.357289 -1.47123
H  8.031116 -1.207983 -2.132676
H  0.397586 0.031568 1.378891
H  1.268673 0.65645 -2.777072
H  5.408133 0.733859 -0.789612
H  3.556344 -0.107832 -2.392754
H  8.580657 -2.657263 2.793958
H  9.20363 -3.753774 1.581976
H  3.761412 -0.513737 2.437745
H  2.061782 -0.502769 2.894535
H  2.792808 -1.969779 2.263619
H  11.049257 -2.520642 2.708782
H  10.36163 -0.975645 2.209305
H  11.016499 -2.092301 1.002948
elementType: Cl F O N C H
totalener: -2672.99791167 hartree
nucrepener: 4100.25080854 hartree
electener: -6773.24872020 hartree
twoeener: 5058.39184276 hartree
cpcmener: -0.06871581 hartree
kineticenergy: 2664.88352578 hartree
xcener: -201.535913782460 hartree
chargesum: 0.0000000
charge: -0.058481 -0.056121 -0.173343 -0.174919 -0.171567 -0.186640 -0.245268 -0.287521 -0.548077 -0.535392 -0.127520 -0.189612 0.034881 0.268963 -0.072644 0.194247 -0.033273 0.475361 -0.073924 0.132907 -0.176347 -0.157391 0.001132 -0.103302 0.043554 -0.082759 -0.171608 0.269508 -0.181025 0.379143 0.036389 0.037265 -0.020044 0.193483 -0.258447 -0.249444 0.126854 0.127002 0.120635 0.143383 0.130438 0.100601 0.112878 0.133116 0.145958 0.189931 0.152809 0.089596 0.109462 0.102391 0.099330 0.107651 0.096416 0.089548 0.089835
qa: -0.0585 -0.0561 -0.1733 -0.1749 -0.1716 -0.1866 -0.2453 -0.2875 -0.5481 -0.5354 -0.1275 -0.1896 0.0349 0.2690 -0.0726 0.1942 -0.0333 0.4754 -0.0739 0.1329 -0.1763 -0.1574 0.0011 -0.1033 0.0436 -0.0828 -0.1716 0.2695 -0.1810 0.3791 0.0364 0.0373 -0.0200 0.1935 -0.2584 -0.2494 0.1269 0.1270 0.1206 0.1434 0.1304 0.1006 0.1129 0.1331 0.1460 0.1899 0.1528 0.0896 0.1095 0.1024 0.0993 0.1077 0.0964 0.0895 0.0898
va: 1.2418 1.2459 1.1389 1.1376 1.1427 1.1312 1.9887 1.8823 1.9536 1.9581 2.9772 3.2397 3.1222 3.8550 3.9255 3.8539 3.8516 4.4931 3.7863 3.8357 4.0696 4.0945 3.9822 3.9119 3.6087 3.8738 4.0078 4.1882 4.0009 4.1230 3.8684 3.8690 3.8835 4.1636 3.9275 3.9182 1.0071 1.0195 1.0117 1.0198 1.0410 1.0096 0.9938 1.0078 1.0228 0.9986 1.0116 1.0159 1.0009 1.0070 1.0051 1.0018 1.0062 1.0036 1.0084
dispcorr: -0.029633064 hartree
energy: -2673.027544730918
dipole: 109.63147 -107.05152 2.57995 -18.68457 19.78707 1.10250 9.86838 -10.18973 -0.32134
magnitude: 2.82399 au
magnitude: 7.17801 debye
