program: Orca
programVersion: 5.0.2
elementType: Cl Cl F F F F O O O O N N N C C C C C C C C C C C C C C C C C C C C C C C H H H H H H H H H H H H H H H H H H H
charge: 0
multiplicity: 1
keywords: wb97x-d3
keywords: def2-TZVPP
keywords: def2/J RIJCOSX
keywords: DEFGRID2
keywords: scfconv7
keywords: smallprint printgap noloewdin
keywords: NOSOSCF
formula: C23H19Cl2F4N3O4
InChI: InChI=1/C23H19Cl2F4N3O4/c1-3-32-21(34)18(10-35-32)30-20(33)14-5-4-12(6-11(14)2)17-9-22(36-31-17,23(27,28)29)13-7-15(24)19(26)16(25)8-13/h4-8,18,30H,3,9-10H2,1-2H3
55 atoms
Cl -5.808479 0.918902 3.607477
Cl -6.873775 -1.849348 -0.829336
F  -4.408427 2.821471 -2.024386
F  -3.715365 3.741194 -0.207031
F  -2.380675 3.530356 -1.881345
F  -7.189187 -0.988923 1.919554
O  -2.556898 0.824404 -1.863223
O  8.803057 -1.767944 -0.469815
O  6.209435 -3.915246 0.277373
O  5.591893 0.967108 0.824424
N  -1.228259 0.481521 -1.836286
N  5.33093 -1.183259 0.226481
N  8.201329 -3.01404 -0.380867
C  -2.920411 1.556084 -0.689795
C  -1.629461 1.636829 0.134288
C  -0.685673 0.91163 -0.76702
C  -4.075444 0.867966 0.010852
C  -3.362143 2.929932 -1.205075
C  0.726028 0.679034 -0.471776
C  6.704297 -1.515491 0.477792
C  -4.854118 -0.059003 -0.669918
C  -4.37008 1.182757 1.332636
C  7.731062 -0.822592 -0.406067
C  1.266953 1.160969 0.716682
C  3.413052 0.263314 0.159232
C  2.605096 0.976709 1.052149
C  1.548099 -0.022568 -1.352742
C  6.972724 -2.971859 0.12666
C  2.873337 -0.230319 -1.029005
C  4.865561 0.057611 0.438458
C  -5.425569 0.557064 1.971932
C  -5.90454 -0.683581 -0.019318
C  8.93653 -4.110774 -0.95551
C  -6.18957 -0.379312 1.298686
C  3.102799 1.52896 2.355952
C  9.056122 -4.019001 -2.464863
H  -1.716392 1.12896 1.095627
H  -1.290409 2.652685 0.343664
H  6.949556 -1.371536 1.537382
H  -4.649915 -0.317747 -1.698946
H  -3.776277 1.898661 1.885433
H  7.322928 -0.638389 -1.405353
H  8.139481 0.096131 0.005004
H  0.638024 1.696722 1.417106
H  1.159907 -0.408153 -2.28519
H  4.690613 -1.927777 -0.011497
H  3.500614 -0.770858 -1.726028
H  9.921836 -4.152453 -0.488135
H  8.409167 -5.016905 -0.662026
H  2.264048 1.781864 3.002284
H  3.73208 0.820048 2.893004
H  3.686576 2.437839 2.209535
H  9.593074 -3.123518 -2.775452
H  8.074799 -4.01768 -2.938673
H  9.609029 -4.88156 -2.835173
elementType: Cl F O N C H
totalener: -2672.99712287 hartree
nucrepener: 4074.21495768 hartree
electener: -6747.21208056 hartree
twoeener: 5031.00469568 hartree
cpcmener: -0.05656383 hartree
kineticenergy: 2664.86423625 hartree
xcener: -201.532872629110 hartree
chargesum: 0.0000000
charge: -0.056122 -0.058202 -0.170521 -0.173681 -0.174163 -0.186534 -0.245554 -0.285553 -0.551646 -0.548323 -0.125182 -0.192285 0.040616 0.254106 -0.070417 0.210354 -0.025420 0.475090 -0.087051 0.109186 -0.153802 -0.173987 0.016394 -0.103960 0.054782 -0.064057 -0.178735 0.279826 -0.176840 0.379204 0.030444 0.038366 -0.009182 0.195051 -0.260087 -0.244427 0.129180 0.121280 0.114712 0.129953 0.140810 0.099911 0.111348 0.131359 0.147287 0.175374 0.147828 0.107206 0.091267 0.096950 0.109108 0.103995 0.089246 0.087740 0.097760
qa: -0.0561 -0.0582 -0.1705 -0.1737 -0.1742 -0.1865 -0.2456 -0.2856 -0.5516 -0.5483 -0.1252 -0.1923 0.0406 0.2541 -0.0704 0.2104 -0.0254 0.4751 -0.0871 0.1092 -0.1538 -0.1740 0.0164 -0.1040 0.0548 -0.0641 -0.1787 0.2798 -0.1768 0.3792 0.0304 0.0384 -0.0092 0.1951 -0.2601 -0.2444 0.1292 0.1213 0.1147 0.1300 0.1408 0.0999 0.1113 0.1314 0.1473 0.1754 0.1478 0.1072 0.0913 0.0969 0.1091 0.1040 0.0892 0.0877 0.0978
va: 1.2458 1.2420 1.1427 1.1385 1.1400 1.1310 1.9831 1.8802 1.9606 1.9558 2.9848 3.2350 3.2035 3.8818 3.9142 3.8510 3.8281 4.4873 3.8163 3.7985 4.0824 4.0785 3.9361 3.9107 3.6304 3.8602 4.0169 4.2627 3.9951 4.1031 3.8783 3.8641 3.8759 4.1609 3.9252 3.9159 1.0070 1.0216 1.0148 1.0412 1.0220 1.0047 1.0068 1.0097 1.0243 1.0266 1.0176 0.9980 1.0181 1.0046 0.9966 1.0034 1.0089 1.0047 1.0067
dispcorr: -0.028810947 hartree
energy: -2673.025933820708
dipole: 105.35726 -103.27989 2.07737 -20.61811 20.59214 -0.02597 -4.16632 4.68206 0.51574
magnitude: 2.14059 au
magnitude: 5.44095 debye
