program: Orca
programVersion: 5.0.2
elementType: Cl Cl F F F F O O O O N N N C C C C C C C C C C C C C C C C C C C C C C C H H H H H H H H H H H H H H H H H H H
charge: 0
multiplicity: 1
keywords: wb97x-d3
keywords: def2-TZVPP
keywords: def2/J RIJCOSX
keywords: DEFGRID2
keywords: scfconv7
keywords: smallprint printgap noloewdin
keywords: NOSOSCF
formula: C23H19Cl2F4N3O4
InChI: InChI=1/C23H19Cl2F4N3O4/c1-3-32-21(34)18(10-35-32)30-20(33)14-5-4-12(6-11(14)2)17-9-22(36-31-17,23(27,28)29)13-7-15(24)19(26)16(25)8-13/h4-8,18,30H,3,9-10H2,1-2H3
55 atoms
Cl -6.05418 -0.098086 3.413293
Cl -7.160648 -1.141496 -1.701416
F  -2.170635 3.847379 -0.79427
F  -4.251342 3.460817 -1.176133
F  -3.534017 3.582545 0.850176
F  -7.530702 -1.187128 1.168006
O  -2.626371 1.347295 -1.751037
O  8.745878 -1.338217 0.618029
O  6.450224 -3.077944 -1.270337
O  5.534724 -0.122561 -1.076486
N  -1.315906 0.958076 -1.872267
N  5.151579 -1.363907 0.759776
N  8.301375 -1.948263 -0.556912
C  -2.946269 1.646554 -0.391723
C  -1.674636 1.299665 0.393517
C  -0.760107 0.926876 -0.726464
C  -4.182598 0.877043 0.02508
C  -3.230667 3.152721 -0.3762
C  0.637474 0.531616 -0.572727
C  6.495343 -1.84844 0.858352
C  -5.007398 0.30403 -0.934422
C  -4.500961 0.759484 1.373283
C  7.567243 -0.83713 1.247881
C  1.289251 0.737976 0.638052
C  3.315669 -0.162626 -0.254714
C  2.628718 0.400209 0.823211
C  1.342865 -0.03111 -1.637745
C  7.040642 -2.383408 -0.459132
C  2.67102 -0.35884 -1.476141
C  4.762431 -0.529117 -0.215695
C  -5.635156 0.065399 1.754995
C  -6.133821 -0.397806 -0.540777
C  9.345227 -2.452501 -1.411386
C  -6.45045 -0.514075 0.79942
C  3.275984 0.685126 2.147443
C  10.122566 -3.606244 -0.803448
H  -1.819568 0.452811 1.06588
H  -1.283304 2.119233 0.997321
H  6.486095 -2.683731 1.563255
H  -4.782218 0.380353 -1.988188
H  -3.86928 1.187777 2.140329
H  7.332718 0.16689 0.885626
H  7.761637 -0.797561 2.316979
H  0.759741 1.191546 1.467059
H  0.858547 -0.210301 -2.587605
H  4.477201 -1.700994 1.428401
H  3.214818 -0.788302 -2.307505
H  8.855639 -2.760802 -2.334027
H  10.005685 -1.62398 -1.668576
H  2.685259 1.405241 2.710946
H  3.356621 -0.21295 2.762434
H  4.278722 1.096072 2.035066
H  10.86502 -3.957606 -1.51929
H  9.464429 -4.441621 -0.564213
H  10.64963 -3.309717 0.102499
elementType: Cl F O N C H
totalener: -2672.99644086 hartree
nucrepener: 4097.60627946 hartree
electener: -6770.60272032 hartree
twoeener: 5055.39657603 hartree
cpcmener: -0.07353554 hartree
kineticenergy: 2664.90070618 hartree
xcener: -201.539293175829 hartree
chargesum: -0.0000000
charge: -0.056349 -0.058175 -0.174679 -0.170858 -0.174136 -0.186962 -0.246603 -0.288143 -0.544272 -0.540761 -0.127376 -0.187857 0.032187 0.238027 -0.070175 0.195796 -0.008949 0.476673 -0.064018 0.139244 -0.158127 -0.172972 -0.000742 -0.108833 0.067218 -0.095773 -0.189043 0.262507 -0.181122 0.393776 0.026667 0.039253 -0.021159 0.194109 -0.269289 -0.250568 0.134611 0.121364 0.119860 0.130278 0.141876 0.100616 0.113662 0.133175 0.146705 0.189886 0.147015 0.090229 0.109669 0.100111 0.112360 0.113879 0.096468 0.089724 0.089996
qa: -0.0563 -0.0582 -0.1747 -0.1709 -0.1741 -0.1870 -0.2466 -0.2881 -0.5443 -0.5408 -0.1274 -0.1879 0.0322 0.2380 -0.0702 0.1958 -0.0089 0.4767 -0.0640 0.1392 -0.1581 -0.1730 -0.0007 -0.1088 0.0672 -0.0958 -0.1890 0.2625 -0.1811 0.3938 0.0267 0.0393 -0.0212 0.1941 -0.2693 -0.2506 0.1346 0.1214 0.1199 0.1303 0.1419 0.1006 0.1137 0.1332 0.1467 0.1899 0.1470 0.0902 0.1097 0.1001 0.1124 0.1139 0.0965 0.0897 0.0900
va: 1.2454 1.2422 1.1391 1.1424 1.1384 1.1305 1.9820 1.8822 1.9647 1.9546 2.9714 3.2421 3.1103 3.9070 3.8916 3.8611 3.7960 4.4854 3.7834 3.8197 4.0837 4.0796 3.9839 3.9188 3.5881 3.8810 4.0051 4.2176 4.0140 4.1105 3.8871 3.8632 3.8826 4.1622 3.9483 3.9185 1.0077 1.0251 1.0124 1.0414 1.0224 1.0099 0.9936 1.0084 1.0245 0.9962 1.0157 1.0154 1.0015 1.0047 0.9912 0.9948 1.0064 1.0040 1.0084
dispcorr: -0.029591633 hartree
energy: -2673.026032492994
dipole: 109.11448 -107.32409 1.79038 -21.41847 21.18477 -0.23369 3.86461 0.70782 4.57243
magnitude: 4.91602 au
magnitude: 12.49552 debye
