program: Orca
programVersion: 5.0.2
elementType: Cl Cl F F F F O O O O N N N C C C C C C C C C C C C C C C C C C C C C C C H H H H H H H H H H H H H H H H H H H
charge: 0
multiplicity: 1
keywords: wb97x-d3
keywords: def2-TZVPP
keywords: def2/J RIJCOSX
keywords: DEFGRID2
keywords: scfconv7
keywords: smallprint printgap noloewdin
keywords: NOSOSCF
formula: C23H19Cl2F4N3O4
InChI: InChI=1/C23H19Cl2F4N3O4/c1-3-32-21(34)18(10-35-32)30-20(33)14-5-4-12(6-11(14)2)17-9-22(36-31-17,23(27,28)29)13-7-15(24)19(26)16(25)8-13/h4-8,18,30H,3,9-10H2,1-2H3
55 atoms
Cl -6.146095 -2.21281 1.416022
Cl -6.683936 0.52613 -3.135737
F  -3.867529 2.303005 2.374795
F  -2.470076 3.695674 1.509976
F  -4.442221 3.492164 0.676586
F  -7.304116 -1.48097 -1.137869
O  -2.415726 2.423824 -0.860745
O  8.496987 -2.289082 -0.68519
O  6.646569 -1.836328 2.188605
O  4.691198 -2.148234 -0.215006
N  -1.098476 2.11542 -1.079681
N  5.68579 -0.137014 -0.045886
N  7.948611 -2.704194 0.526037
C  -2.920845 1.723642 0.277461
C  -1.708313 0.970677 0.839897
C  -0.674116 1.323149 -0.182067
C  -4.081195 0.83517 -0.127491
C  -3.430277 2.817524 1.223211
C  0.693248 0.803228 -0.183801
C  7.014819 -0.661745 0.056963
C  -4.753125 1.063927 -1.321007
C  -4.508502 -0.174666 0.726239
C  7.585605 -1.317555 -1.195513
C  1.631646 1.227817 -1.125179
C  3.274713 -0.250486 -0.205583
C  2.925581 0.721943 -1.15269
C  1.064063 -0.158182 0.752294
C  7.151518 -1.786532 1.082046
C  2.33993 -0.689505 0.724568
C  4.607273 -0.930031 -0.17128
C  -5.597493 -0.955038 0.381377
C  -5.838367 0.274363 -1.660484
C  8.586825 -3.841136 1.132038
C  -6.263734 -0.729213 -0.809606
C  3.884147 1.20822 -2.202126
C  10.025682 -3.582046 1.544897
H  -1.871815 -0.106079 0.884953
H  -1.400972 1.287059 1.838896
H  7.660387 0.155208 0.389929
H  -4.440759 1.845463 -1.998767
H  -3.999844 -0.375985 1.659932
H  6.806792 -1.796647 -1.794803
H  8.154773 -0.637334 -1.825864
H  1.347481 1.965933 -1.865266
H  0.362937 -0.5131 1.495912
H  5.563625 0.858569 0.047525
H  2.613374 -1.450673 1.443954
H  7.979106 -4.10048 1.998362
H  8.52529 -4.68111 0.437541
H  4.477025 0.398206 -2.627125
H  3.346457 1.686034 -3.019828
H  4.581293 1.948325 -1.803821
H  10.090272 -2.75452 2.25195
H  10.661972 -3.357372 0.689284
H  10.428316 -4.471136 2.030677
elementType: Cl F O N C H
totalener: -2673.00534634 hartree
nucrepener: 4097.55985732 hartree
electener: -6770.56520366 hartree
twoeener: 5055.51393110 hartree
cpcmener: -0.05677427 hartree
kineticenergy: 2664.87516487 hartree
xcener: -201.533168926148 hartree
chargesum: -0.0000000
charge: -0.053929 -0.055597 -0.174138 -0.172256 -0.168846 -0.184738 -0.238293 -0.280408 -0.512626 -0.501511 -0.123090 -0.189769 0.039963 0.254694 -0.071835 0.202808 -0.038712 0.479975 -0.075750 0.128189 -0.147316 -0.176600 -0.000320 -0.119469 0.064736 -0.078677 -0.173853 0.242810 -0.190594 0.374787 0.024803 0.034479 -0.023474 0.199571 -0.269449 -0.245667 0.122208 0.121137 0.114157 0.129527 0.137398 0.098676 0.108375 0.128132 0.144052 0.181710 0.145481 0.089372 0.106458 0.112774 0.101076 0.108700 0.088476 0.088571 0.093823
qa: -0.0539 -0.0556 -0.1741 -0.1723 -0.1688 -0.1847 -0.2383 -0.2804 -0.5126 -0.5015 -0.1231 -0.1898 0.0400 0.2547 -0.0718 0.2028 -0.0387 0.4800 -0.0757 0.1282 -0.1473 -0.1766 -0.0003 -0.1195 0.0647 -0.0787 -0.1739 0.2428 -0.1906 0.3748 0.0248 0.0345 -0.0235 0.1996 -0.2694 -0.2457 0.1222 0.1211 0.1142 0.1295 0.1374 0.0987 0.1084 0.1281 0.1441 0.1817 0.1455 0.0894 0.1065 0.1128 0.1011 0.1087 0.0885 0.0886 0.0938
va: 1.2477 1.2445 1.1370 1.1432 1.1445 1.1336 1.9934 1.8872 2.0102 2.0034 2.9919 3.2232 3.1070 3.8861 3.9263 3.8404 3.8311 4.4749 3.8011 3.8173 4.0740 4.0872 3.9849 3.9506 3.5989 3.8574 3.9610 4.2519 4.0431 4.1385 3.8917 3.8703 3.8877 4.1527 3.9521 3.9133 1.0078 1.0212 1.0126 1.0414 1.0235 1.0100 0.9928 1.0349 1.0046 1.0013 1.0151 1.0170 1.0005 0.9950 1.0050 0.9917 1.0039 1.0084 1.0065
dispcorr: -0.029546910 hartree
energy: -2673.034893247090
dipole: 110.40327 -107.64147 2.76180 -18.04969 18.97757 0.92787 -0.29709 0.08628 -0.21082
magnitude: 2.92112 au
magnitude: 7.42491 debye
