program: Orca
programVersion: 5.0.2
elementType: Cl Cl F F F F O O O O N N N C C C C C C C C C C C C C C C C C C C C C C C H H H H H H H H H H H H H H H H H H H
charge: 0
multiplicity: 1
keywords: wb97x-d3
keywords: def2-TZVPP
keywords: def2/J RIJCOSX
keywords: DEFGRID2
keywords: scfconv7
keywords: smallprint printgap noloewdin
keywords: NOSOSCF
formula: C23H19Cl2F4N3O4
InChI: InChI=1/C23H19Cl2F4N3O4/c1-3-32-21(34)18(10-35-32)30-20(33)14-5-4-12(6-11(14)2)17-9-22(36-31-17,23(27,28)29)13-7-15(24)19(26)16(25)8-13/h4-8,18,30H,3,9-10H2,1-2H3
55 atoms
Cl -7.207601 -1.40299 -1.755005
Cl -6.253238 -0.055382 3.322132
F  -3.682873 3.365454 0.602015
F  -2.247732 3.5681 -0.992424
F  -4.294715 3.08415 -1.442111
F  -7.700769 -1.214679 1.093785
O  -2.597846 0.97879 -1.79327
O  8.582227 -2.128662 0.941946
O  7.192956 -0.699329 -1.871617
O  5.522731 0.19132 0.616216
N  -1.289479 0.579229 -1.829186
N  5.148093 -1.903154 -0.117358
N  8.551749 -1.218755 -0.111337
C  -2.97679 1.372077 -0.473188
C  -1.727848 1.116031 0.381416
C  -0.774656 0.640596 -0.66964
C  -4.221958 0.621057 -0.047892
C  -3.304568 2.866884 -0.578335
C  0.618268 0.261976 -0.434123
C  6.525819 -2.291477 -0.119856
C  -4.59194 0.600707 1.291707
C  -5.029001 0.009152 -0.998679
C  7.214116 -2.405991 1.236069
C  1.212632 0.528318 0.796555
C  3.288484 -0.385946 0.039064
C  2.547132 0.228324 1.053556
C  1.372913 -0.35494 -1.431588
C  7.434223 -1.297246 -0.839159
C  2.691634 -0.680502 -1.185988
C  4.746047 -0.66261 0.216584
C  -6.196838 -0.621487 -0.605011
C  -5.766252 -0.022863 1.674262
C  9.814425 -0.6150 -0.439494
C  -6.571987 -0.627082 0.725733
C  3.12955 0.563894 2.395243
C  10.860769 -1.61132 -0.908198
H  -1.889721 0.345144 1.135906
H  -1.35523 1.998497 0.903642
H  6.594226 -3.23843 -0.66198
H  -3.975801 1.061339 2.052629
H  -4.761893 0.008824 -2.045756
H  6.820421 -1.682994 1.955087
H  7.171067 -3.403552 1.668224
H  0.63438 0.994336 1.585325
H  0.934161 -0.581632 -2.393882
H  4.464077 -2.591656 -0.385094
H  3.272569 -1.147793 -1.971519
H  9.602987 0.1161 -1.218832
H  10.168855 -0.059708 0.430991
H  3.771102 1.443798 2.343302
H  2.337608 0.778695 3.111228
H  3.729026 -0.251351 2.800421
H  10.516948 -2.164756 -1.782337
H  11.125153 -2.324626 -0.128099
H  11.769066 -1.076294 -1.185315
elementType: Cl F O N C H
totalener: -2673.00619587 hartree
nucrepener: 4090.83560731 hartree
electener: -6763.84180318 hartree
twoeener: 5048.81940525 hartree
cpcmener: -0.05625389 hartree
kineticenergy: 2664.88824828 hartree
xcener: -201.535488534107 hartree
chargesum: 0.0000000
charge: -0.055218 -0.054320 -0.174565 -0.172940 -0.167891 -0.184550 -0.236919 -0.280547 -0.513945 -0.501126 -0.117716 -0.191280 0.042316 0.234023 -0.081225 0.196766 -0.006881 0.478208 -0.071214 0.114069 -0.178923 -0.159300 0.001559 -0.108167 0.039631 -0.071258 -0.174410 0.254710 -0.184007 0.372304 0.040142 0.026933 -0.023607 0.193352 -0.256883 -0.245890 0.130689 0.119140 0.114214 0.137600 0.130350 0.096595 0.107672 0.130364 0.146445 0.181051 0.147350 0.089342 0.106894 0.106907 0.095305 0.106956 0.089075 0.089295 0.093525
qa: -0.0552 -0.0543 -0.1746 -0.1729 -0.1679 -0.1846 -0.2369 -0.2805 -0.5139 -0.5011 -0.1177 -0.1913 0.0423 0.2340 -0.0812 0.1968 -0.0069 0.4782 -0.0712 0.1141 -0.1789 -0.1593 0.0016 -0.1082 0.0396 -0.0713 -0.1744 0.2547 -0.1840 0.3723 0.0401 0.0269 -0.0236 0.1934 -0.2569 -0.2459 0.1307 0.1191 0.1142 0.1376 0.1303 0.0966 0.1077 0.1304 0.1464 0.1811 0.1473 0.0893 0.1069 0.1069 0.0953 0.1070 0.0891 0.0893 0.0935
va: 1.2450 1.2474 1.1371 1.1414 1.1465 1.1339 1.9962 1.8867 2.0066 2.0006 2.9853 3.2309 3.1135 3.9222 3.8995 3.8541 3.8040 4.4763 3.8100 3.8329 4.0823 4.0848 3.9806 3.9086 3.6092 3.8754 4.0203 4.2253 4.0085 4.1438 3.8685 3.8956 3.8879 4.1600 3.9330 3.9133 1.0081 1.0235 1.0107 1.0241 1.0415 1.0113 0.9925 1.0098 1.0246 1.0033 1.0204 1.0175 0.9996 1.0039 1.0048 0.9963 1.0036 1.0083 1.0067
dispcorr: -0.029301933 hartree
energy: -2673.035497801331
dipole: 111.35510 -110.05960 1.29549 -17.45936 15.09585 -2.36350 4.40574 -2.01986 2.38587
magnitude: 3.59956 au
magnitude: 9.14935 debye
