program: Orca
programVersion: 5.0.2
elementType: Cl Cl F F F F O O O O N N N C C C C C C C C C C C C C C C C C C C C C C C H H H H H H H H H H H H H H H H H H H
charge: 0
multiplicity: 1
keywords: wb97x-d3
keywords: def2-TZVPP
keywords: def2/J RIJCOSX
keywords: DEFGRID2
keywords: scfconv7
keywords: smallprint printgap noloewdin
keywords: NOSOSCF
formula: C23H19Cl2F4N3O4
InChI: InChI=1/C23H19Cl2F4N3O4/c1-3-32-21(34)18(10-35-32)30-20(33)14-5-4-12(6-11(14)2)17-9-22(36-31-17,23(27,28)29)13-7-15(24)19(26)16(25)8-13/h4-8,18,30H,3,9-10H2,1-2H3
55 atoms
Cl -7.130707 -0.450104 -2.379931
Cl -5.98018 -1.15889 2.782801
F  -3.472355 3.199309 1.461584
F  -2.105453 3.920733 -0.039522
F  -4.185098 3.642945 -0.519871
F  -7.48852 -1.423451 0.321593
O  -2.505455 1.792565 -1.651303
O  8.771345 -1.625664 0.231511
O  5.898089 -2.664365 1.837368
O  5.178119 -1.581617 -1.024035
N  -1.182255 1.487393 -1.834407
N  5.562514 -0.038672 0.572748
N  7.903955 -2.579828 0.749681
C  -2.863577 1.692621 -0.271245
C  -1.609165 1.13909 0.415682
C  -0.653316 1.134794 -0.73443
C  -4.10526 0.839823 -0.120465
C  -3.162369 3.131843 0.164749
C  0.747129 0.725722 -0.646704
C  6.834606 -0.565625 0.967675
C  -4.424584 0.300927 1.120147
C  -4.940263 0.619523 -1.208611
C  7.961367 -0.484157 -0.056656
C  1.554813 0.675822 -1.785476
C  3.402936 -0.096177 -0.478227
C  2.875928 0.259575 -1.729025
C  1.28837 0.370357 0.58359
C  6.785546 -2.064336 1.256721
C  2.612063 -0.029471 0.661662
C  4.788637 -0.639207 -0.351306
C  -6.080942 -0.149053 -1.05291
C  -5.567423 -0.465301 1.265745
C  8.417366 -3.919601 0.815916
C  -6.395618 -0.688685 0.180496
C  3.693532 0.212911 -2.986184
C  9.61977 -4.062371 1.732525
H  -1.756387 0.126127 0.794469
H  -1.251165 1.74152 1.25155
H  7.1201 -0.060264 1.893949
H  -3.785824 0.454513 1.979917
H  -4.714117 1.027946 -2.183337
H  7.586335 -0.528808 -1.081761
H  8.59112 0.395897 0.057025
H  1.140492 0.962616 -2.744158
H  0.691729 0.397108 1.485736
H  5.193009 0.74126 1.092838
H  3.019909 -0.319256 1.622228
H  7.591849 -4.538232 1.166138
H  8.657947 -4.250221 -0.196781
H  3.191292 0.750366 -3.789008
H  4.677538 0.663013 -2.851883
H  3.849357 -0.811437 -3.324983
H  10.473203 -3.483394 1.38067
H  9.924239 -5.108397 1.767183
H  9.382399 -3.747442 2.748932
elementType: Cl F O N C H
totalener: -2673.00612832 hartree
nucrepener: 4098.97540590 hartree
electener: -6771.98153421 hartree
twoeener: 5057.14786437 hartree
cpcmener: -0.05488781 hartree
kineticenergy: 2664.89612697 hartree
xcener: -201.537454155479 hartree
chargesum: -0.0000000
charge: -0.054950 -0.053816 -0.174422 -0.173188 -0.168816 -0.184265 -0.236560 -0.280617 -0.519972 -0.499695 -0.119933 -0.194533 0.053765 0.240206 -0.081258 0.197862 -0.012331 0.474785 -0.079406 0.121342 -0.173211 -0.158287 0.003740 -0.114403 0.056941 -0.060108 -0.169499 0.245036 -0.199214 0.364571 0.038136 0.025348 -0.021992 0.193820 -0.259386 -0.241730 0.131188 0.119294 0.114060 0.139699 0.131751 0.097056 0.106155 0.128372 0.145687 0.180736 0.144437 0.089167 0.106429 0.097063 0.108398 0.107357 0.089205 0.092514 0.087473
qa: -0.0549 -0.0538 -0.1744 -0.1732 -0.1688 -0.1843 -0.2366 -0.2806 -0.5200 -0.4997 -0.1199 -0.1945 0.0538 0.2402 -0.0813 0.1979 -0.0123 0.4748 -0.0794 0.1213 -0.1732 -0.1583 0.0037 -0.1144 0.0569 -0.0601 -0.1695 0.2450 -0.1992 0.3646 0.0381 0.0253 -0.0220 0.1938 -0.2594 -0.2417 0.1312 0.1193 0.1141 0.1397 0.1318 0.0971 0.1062 0.1284 0.1457 0.1807 0.1444 0.0892 0.1064 0.0971 0.1084 0.1074 0.0892 0.0925 0.0875
va: 1.2450 1.2482 1.1379 1.1414 1.1450 1.1342 1.9947 1.8841 2.0001 2.0006 2.9884 3.2238 3.1271 3.9073 3.9131 3.8477 3.8110 4.4823 3.8156 3.8250 4.0733 4.0855 3.9767 3.9410 3.5864 3.8564 3.9846 4.2372 4.0416 4.1521 3.8690 3.8909 3.8871 4.1585 3.9368 3.9109 1.0064 1.0215 1.0089 1.0225 1.0406 1.0112 0.9920 1.0361 1.0043 1.0044 1.0239 1.0182 0.9999 1.0047 0.9954 1.0041 1.0084 1.0065 1.0045
dispcorr: -0.029327405 hartree
energy: -2673.035455721203
dipole: 108.84651 -106.11269 2.73382 -21.15897 22.63768 1.47871 -0.57112 2.22979 1.65867
magnitude: 3.52300 au
magnitude: 8.95476 debye
