program: Orca
programVersion: 5.0.2
elementType: Cl Cl F F F F O O O O N N N C C C C C C C C C C C C C C C C C C C C C C C H H H H H H H H H H H H H H H H H H H
charge: 0
multiplicity: 1
keywords: wb97x-d3
keywords: def2-TZVPP
keywords: def2/J RIJCOSX
keywords: DEFGRID2
keywords: scfconv7
keywords: smallprint printgap noloewdin
keywords: NOSOSCF
formula: C23H19Cl2F4N3O4
InChI: InChI=1/C23H19Cl2F4N3O4/c1-3-32-21(34)18(10-35-32)30-20(33)14-5-4-12(6-11(14)2)17-9-22(36-31-17,23(27,28)29)13-7-15(24)19(26)16(25)8-13/h4-8,18,30H,3,9-10H2,1-2H3
55 atoms
Cl -5.669895 -2.411501 1.455143
Cl -6.699186 0.543807 -2.867864
F  -3.53421 2.218928 2.460387
F  -2.179654 3.635861 1.567828
F  -4.20063 3.477734 0.848429
F  -7.063444 -1.596401 -0.951688
O  -2.324653 2.47044 -0.869804
O  7.288906 -3.320693 -0.828635
O  6.763438 -2.230374 2.399292
O  6.008816 1.387994 -0.239255
N  -0.974736 2.370766 -1.083596
N  5.53201 -0.808194 -0.010157
N  7.294443 -3.461441 0.551968
C  -2.71425 1.721555 0.283933
C  -1.434985 0.998999 0.725191
C  -0.449207 1.587314 -0.232672
C  -3.876555 0.816087 -0.061846
C  -3.163761 2.774468 1.305009
C  0.982501 1.291843 -0.242338
C  6.897802 -1.233729 0.152172
C  -4.653449 1.077154 -1.183219
C  -4.18764 -0.258047 0.763044
C  7.524943 -1.92846 -1.046635
C  1.819341 1.831871 -1.220846
C  3.718298 0.743298 -0.251962
C  3.183343 1.582445 -1.242803
C  1.529497 0.461689 0.72906
C  6.965405 -2.340266 1.202676
C  2.887573 0.188286 0.714245
C  5.189559 0.484976 -0.175998
C  -5.265211 -1.07109 0.459099
C  -5.726952 0.255781 -1.480589
C  7.319185 -4.816514 1.034901
C  -6.034919 -0.81447 -0.661257
C  4.019747 2.194408 -2.328464
C  6.067635 -5.603406 0.688261
H  -1.501417 -0.08186 0.58893
H  -1.155859 1.170928 1.765845
H  7.492751 -0.380071 0.473156
H  -4.43319 1.905833 -1.840745
H  -3.594222 -0.483777 1.639342
H  7.083645 -1.658071 -2.004075
H  8.60183 -1.736736 -1.071815
H  1.397756 2.465237 -1.991526
H  0.912437 0.023552 1.502532
H  4.811946 -1.513273 -0.077107
H  3.299948 -0.449657 1.48613
H  8.210753 -5.305805 0.638889
H  7.445146 -4.75001 2.114856
H  4.698972 1.471978 -2.781594
H  3.382772 2.588928 -3.118986
H  4.625463 3.01967 -1.954223
H  6.141174 -6.603838 1.114737
H  5.938524 -5.712757 -0.388231
H  5.175781 -5.12863 1.097896
elementType: Cl F O N C H
totalener: -2673.00554430 hartree
nucrepener: 4095.48195265 hartree
electener: -6768.48749695 hartree
twoeener: 5052.16581660 hartree
cpcmener: -0.05244730 hartree
kineticenergy: 2664.88314627 hartree
xcener: -201.530940495064 hartree
chargesum: 0.0000000
charge: -0.054190 -0.055479 -0.173937 -0.172679 -0.169164 -0.184291 -0.236631 -0.277083 -0.511337 -0.504476 -0.119848 -0.178600 0.046248 0.238554 -0.078514 0.206484 -0.011444 0.474886 -0.081753 0.080012 -0.155724 -0.177538 0.028327 -0.114226 0.046940 -0.054643 -0.172514 0.255869 -0.197808 0.362949 0.028303 0.038900 -0.021053 0.193181 -0.259922 -0.242551 0.129407 0.120270 0.099342 0.129754 0.140189 0.105215 0.098973 0.128161 0.146748 0.179236 0.147783 0.105725 0.090512 0.108178 0.096088 0.106060 0.094584 0.090561 0.087963
qa: -0.0542 -0.0555 -0.1739 -0.1727 -0.1692 -0.1843 -0.2366 -0.2771 -0.5113 -0.5045 -0.1198 -0.1786 0.0462 0.2386 -0.0785 0.2065 -0.0114 0.4749 -0.0818 0.0800 -0.1557 -0.1775 0.0283 -0.1142 0.0469 -0.0546 -0.1725 0.2559 -0.1978 0.3629 0.0283 0.0389 -0.0211 0.1932 -0.2599 -0.2426 0.1294 0.1203 0.0993 0.1298 0.1402 0.1052 0.0990 0.1282 0.1467 0.1792 0.1478 0.1057 0.0905 0.1082 0.0961 0.1061 0.0946 0.0906 0.0880
va: 1.2476 1.2450 1.1384 1.1418 1.1444 1.1344 1.9940 1.8821 2.0129 2.0044 2.9881 3.2020 3.1469 3.9041 3.9105 3.8373 3.8160 4.4832 3.8071 3.8016 4.0845 4.0772 3.9655 3.9418 3.6106 3.8641 3.9855 4.2841 4.0347 4.1376 3.8903 3.8691 3.8843 4.1604 3.9296 3.9132 1.0073 1.0208 1.0500 1.0415 1.0223 0.9993 1.0013 1.0362 1.0042 1.0074 1.0191 1.0006 1.0169 0.9959 1.0046 1.0045 1.0068 1.0079 1.0041
dispcorr: -0.028785115 hartree
energy: -2673.034329411323
dipole: 96.84832 -95.56745 1.28087 -24.65334 21.66040 -2.99294 -4.29718 3.79785 -0.49934
magnitude: 3.29358 au
magnitude: 8.37162 debye
