program: Orca
programVersion: 5.0.2
elementType: Cl Cl F F F F O O O O N N N C C C C C C C C C C C C C C C C C C C C C C C H H H H H H H H H H H H H H H H H H H
charge: 0
multiplicity: 1
keywords: wb97x-d3
keywords: def2-TZVPP
keywords: def2/J RIJCOSX
keywords: DEFGRID2
keywords: scfconv7
keywords: smallprint printgap noloewdin
keywords: NOSOSCF
formula: C23H19Cl2F4N3O4
InChI: InChI=1/C23H19Cl2F4N3O4/c1-3-32-21(34)18(10-35-32)30-20(33)14-5-4-12(6-11(14)2)17-9-22(36-31-17,23(27,28)29)13-7-15(24)19(26)16(25)8-13/h4-8,18,30H,3,9-10H2,1-2H3
55 atoms
Cl -6.002108 -1.037306 2.824186
Cl -7.12733 -0.497327 -2.365221
F  -3.489688 3.285799 1.390944
F  -2.139263 3.972171 -0.141137
F  -4.219976 3.664658 -0.598262
F  -7.494106 -1.390437 0.364989
O  -2.527544 1.79995 -1.684867
O  8.791357 -1.595148 -0.540694
O  6.282745 -2.715132 1.545692
O  5.021365 -1.723931 -1.158365
N  -1.213749 1.457718 -1.867097
N  5.620658 -0.120241 0.304015
N  8.058348 -2.575343 0.118921
C  -2.883649 1.733578 -0.302447
C  -1.627448 1.199842 0.397734
C  -0.683919 1.129854 -0.759931
C  -4.122172 0.879513 -0.130146
C  -3.188564 3.182154 0.094429
C  0.706776 0.687927 -0.677402
C  6.957687 -0.599509 0.487169
C  -4.950659 0.621118 -1.214924
C  -4.444666 0.376762 1.124596
C  7.891798 -0.499669 -0.714706
C  1.251362 0.345272 0.555406
C  3.336833 -0.2071 -0.473774
C  2.565934 -0.099085 0.685849
C  1.496131 0.576019 -1.823733
C  7.023428 -2.090973 0.806033
C  2.7906 0.115726 -1.715972
C  4.725599 -0.758772 -0.469666
C  -5.583834 -0.391329 1.287796
C  -6.086877 -0.150275 -1.041928
C  8.682648 -3.867475 0.19225
C  -6.404896 -0.65393 0.205822
C  3.082886 -0.460411 2.048975
C  9.960277 -3.877643 1.014212
H  -1.781589 0.209284 0.828859
H  -1.252456 1.839259 1.198351
H  7.377918 -0.066508 1.344035
H  -4.722822 1.001951 -2.200304
H  -3.811074 0.560171 1.98236
H  7.351989 -0.592284 -1.660087
H  8.48847 0.41015 -0.728692
H  0.644771 0.410648 1.450558
H  1.095483 0.830681 -2.795686
H  5.331222 0.68517 0.835792
H  3.392998 0.013125 -2.609655
H  7.940559 -4.535972 0.626782
H  8.869625 -4.217031 -0.824953
H  2.255893 -0.669303 2.726356
H  3.727355 -1.33859 2.034617
H  3.656676 0.357451 2.490468
H  9.775144 -3.549352 2.037362
H  10.730166 -3.239702 0.580671
H  10.357055 -4.892075 1.053735
elementType: Cl F O N C H
totalener: -2673.00550038 hartree
nucrepener: 4103.95117923 hartree
electener: -6776.95667962 hartree
twoeener: 5061.90852481 hartree
cpcmener: -0.05609608 hartree
kineticenergy: 2664.89707572 hartree
xcener: -201.537627732782 hartree
chargesum: -0.0000000
charge: -0.054009 -0.055072 -0.174503 -0.173227 -0.168862 -0.184246 -0.236600 -0.280266 -0.518241 -0.502945 -0.118107 -0.190632 0.047371 0.246851 -0.086482 0.196902 -0.017239 0.474777 -0.071115 0.119567 -0.155986 -0.173736 0.002325 -0.117291 0.056633 -0.084355 -0.195502 0.256511 -0.161977 0.376963 0.026083 0.037434 -0.022858 0.194492 -0.273707 -0.245781 0.129614 0.119650 0.113501 0.131568 0.139511 0.097745 0.106666 0.128878 0.146913 0.181161 0.145482 0.089822 0.107345 0.099251 0.109044 0.109387 0.088324 0.089306 0.093661
qa: -0.0540 -0.0551 -0.1745 -0.1732 -0.1689 -0.1842 -0.2366 -0.2803 -0.5182 -0.5029 -0.1181 -0.1906 0.0474 0.2469 -0.0865 0.1969 -0.0172 0.4748 -0.0711 0.1196 -0.1560 -0.1737 0.0023 -0.1173 0.0566 -0.0844 -0.1955 0.2565 -0.1620 0.3770 0.0261 0.0374 -0.0229 0.1945 -0.2737 -0.2458 0.1296 0.1197 0.1135 0.1316 0.1395 0.0977 0.1067 0.1289 0.1469 0.1812 0.1455 0.0898 0.1073 0.0993 0.1090 0.1094 0.0883 0.0893 0.0937
va: 1.2480 1.2449 1.1378 1.1416 1.1448 1.1342 1.9948 1.8855 1.9955 2.0008 2.9893 3.2267 3.1403 3.9013 3.9193 3.8575 3.8163 4.4829 3.8121 3.8129 4.0837 4.0748 3.9811 3.9253 3.6002 3.8706 4.0126 4.2329 4.0035 4.1414 3.8893 3.8692 3.8852 4.1582 3.9460 3.9133 1.0066 1.0210 1.0111 1.0407 1.0225 1.0109 0.9920 1.0099 1.0247 1.0012 1.0129 1.0172 1.0006 1.0060 1.0115 0.9910 1.0040 1.0083 1.0065
dispcorr: -0.029793134 hartree
energy: -2673.035293518059
dipole: 108.81083 -106.07757 2.73327 -22.39698 24.00309 1.60612 6.48496 -4.58739 1.89758
magnitude: 3.69475 au
magnitude: 9.39130 debye
