program: Orca
programVersion: 5.0.2
elementType: Cl Cl F F F F O O O O N N N C C C C C C C C C C C C C C C C C C C C C C C H H H H H H H H H H H H H H H H H H H
charge: 0
multiplicity: 1
keywords: wb97x-d3
keywords: def2-TZVPP
keywords: def2/J RIJCOSX
keywords: DEFGRID2
keywords: scfconv7
keywords: smallprint printgap noloewdin
keywords: NOSOSCF
formula: C23H19Cl2F4N3O4
InChI: InChI=1/C23H19Cl2F4N3O4/c1-3-32-21(34)18(10-35-32)30-20(33)14-5-4-12(6-11(14)2)17-9-22(36-31-17,23(27,28)29)13-7-15(24)19(26)16(25)8-13/h4-8,18,30H,3,9-10H2,1-2H3
55 atoms
Cl -6.909789 -1.024757 -2.143608
Cl -5.688163 -0.784797 3.048028
F  -3.62368 3.458435 1.029673
F  -2.312193 4.105087 -0.550806
F  -4.341523 3.557567 -0.999193
F  -7.172308 -1.578445 0.688825
O  -2.498672 1.720087 -1.855034
O  8.538231 -2.464664 -0.287913
O  6.078062 -2.870703 2.092386
O  5.838003 1.035876 -0.931559
N  -1.152461 1.515468 -2.008734
N  5.37998 -0.838196 0.224897
N  7.904283 -3.135931 0.746197
C  -2.845945 1.796056 -0.471404
C  -1.544904 1.472783 0.273381
C  -0.592849 1.384463 -0.875858
C  -4.000418 0.8637 -0.172097
C  -3.287035 3.247597 -0.245056
C  0.840489 1.126443 -0.752915
C  6.754278 -1.184151 0.441172
C  -4.264384 0.501299 1.143367
C  -4.818686 0.403938 -1.195794
C  7.55942 -1.554374 -0.796626
C  1.401928 0.944762 0.506193
C  3.555193 0.569409 -0.462415
C  2.754366 0.657697 0.679288
C  1.662135 1.054598 -1.879286
C  6.843738 -2.487791 1.223864
C  3.00729 0.795061 -1.7250
C  5.023832 0.292498 -0.402978
C  -5.886359 -0.426448 -0.899296
C  -5.337584 -0.322501 1.430456
C  8.397398 -4.453792 1.044564
C  -6.148406 -0.786224 0.41003
C  3.288287 0.477819 2.072319
C  8.07417 -5.465691 -0.039554
H  -1.597334 0.519689 0.802738
H  -1.244795 2.225015 1.004332
H  7.264509 -0.39849 1.012146
H  -3.636315 0.841121 1.956284
H  -4.635148 0.671631 -2.226706
H  6.92268 -2.048876 -1.539388
H  8.094196 -0.727476 -1.256899
H  0.781476 1.025259 1.390527
H  1.254553 1.204767 -2.86998
H  4.669528 -1.435121 0.623753
H  3.641465 0.747571 -2.60113
H  9.473899 -4.391453 1.215379
H  7.942469 -4.741302 1.991823
H  4.271908 0.928609 2.202384
H  2.618369 0.938077 2.797718
H  3.373702 -0.576499 2.343671
H  8.462472 -6.443059 0.247182
H  8.52803 -5.197006 -0.993087
H  6.997474 -5.559334 -0.181939
elementType: Cl F O N C H
totalener: -2673.00619836 hartree
nucrepener: 4087.00725354 hartree
electener: -6760.01345190 hartree
twoeener: 5043.64073212 hartree
cpcmener: -0.04761587 hartree
kineticenergy: 2664.88747463 hartree
xcener: -201.533109913649 hartree
chargesum: -0.0000000
charge: -0.055639 -0.054097 -0.174169 -0.172699 -0.168861 -0.184323 -0.236359 -0.278321 -0.517238 -0.510999 -0.116449 -0.202494 0.038425 0.248966 -0.086893 0.200508 -0.015450 0.475250 -0.081459 0.108351 -0.173868 -0.160020 0.016108 -0.110751 0.085559 -0.091306 -0.181566 0.256988 -0.172263 0.354456 0.041793 0.026159 -0.013931 0.192177 -0.268340 -0.243990 0.129208 0.120644 0.111042 0.140064 0.129834 0.093973 0.111889 0.129090 0.147242 0.178435 0.144425 0.106259 0.092775 0.113003 0.100192 0.105560 0.096363 0.089071 0.087677
qa: -0.0556 -0.0541 -0.1742 -0.1727 -0.1689 -0.1843 -0.2364 -0.2783 -0.5172 -0.5110 -0.1164 -0.2025 0.0384 0.2490 -0.0869 0.2005 -0.0155 0.4752 -0.0815 0.1084 -0.1739 -0.1600 0.0161 -0.1108 0.0856 -0.0913 -0.1816 0.2570 -0.1723 0.3545 0.0418 0.0262 -0.0139 0.1922 -0.2683 -0.2440 0.1292 0.1206 0.1110 0.1401 0.1298 0.0940 0.1119 0.1291 0.1472 0.1784 0.1444 0.1063 0.0928 0.1130 0.1002 0.1056 0.0964 0.0891 0.0877
va: 1.2444 1.2480 1.1379 1.1418 1.1452 1.1343 1.9962 1.8892 2.0016 2.0065 2.9890 3.2171 3.1942 3.9022 3.9200 3.8512 3.8159 4.4817 3.8192 3.7928 4.0709 4.0922 3.9419 3.9199 3.5862 3.8847 4.0082 4.2874 4.0125 4.1358 3.8669 3.8939 3.8816 4.1613 3.9502 3.9147 1.0066 1.0204 1.0185 1.0225 1.0410 1.0061 1.0063 1.0095 1.0240 1.0198 1.0138 0.9982 1.0166 0.9950 1.0048 0.9991 1.0073 1.0084 1.0048
dispcorr: -0.029307750 hartree
energy: -2673.035506109882
dipole: 102.10391 -100.30545 1.79846 -27.61529 25.97976 -1.63553 4.10691 -2.74321 1.36370
magnitude: 2.78731 au
magnitude: 7.08478 debye
