program: Orca
programVersion: 5.0.2
elementType: Cl Cl F F F F O O O O N N N C C C C C C C C C C C C C C C C C C C C C C C H H H H H H H H H H H H H H H H H H H
charge: 0
multiplicity: 1
keywords: wb97x-d3
keywords: def2-TZVPP
keywords: def2/J RIJCOSX
keywords: DEFGRID2
keywords: scfconv7
keywords: smallprint printgap noloewdin
keywords: NOSOSCF
formula: C23H19Cl2F4N3O4
InChI: InChI=1/C23H19Cl2F4N3O4/c1-3-32-21(34)18(10-35-32)30-20(33)14-5-4-12(6-11(14)2)17-9-22(36-31-17,23(27,28)29)13-7-15(24)19(26)16(25)8-13/h4-8,18,30H,3,9-10H2,1-2H3
55 atoms
Cl -6.054887 -0.203008 3.426735
Cl -7.031633 -1.260052 -1.713759
F  -3.549834 3.578909 0.955511
F  -2.247557 3.892123 -0.729692
F  -4.327958 3.447106 -1.047266
F  -7.442477 -1.345893 1.152711
O  -2.594629 1.396881 -1.673226
O  8.65158 -1.390726 1.181118
O  6.548041 -2.803888 -1.158563
O  5.645933 0.119967 -0.605619
N  -1.28786 1.000855 -1.77468
N  5.059457 -1.395603 0.953291
N  8.329557 -1.860209 -0.087768
C  -2.94183 1.668338 -0.314782
C  -1.670892 1.344419 0.483866
C  -0.74607 0.961623 -0.626423
C  -4.15882 0.854195 0.076483
C  -3.272763 3.165168 -0.283294
C  0.651434 0.569242 -0.453772
C  6.385772 -1.909618 1.126867
C  -4.945271 0.256649 -0.90002
C  -4.498559 0.719629 1.4178
C  7.412386 -0.97522 1.758424
C  1.42656 0.196988 -1.554068
C  3.328314 -0.135507 -0.142717
C  2.762032 -0.150627 -1.427285
C  1.227522 0.568596 0.811487
C  7.063448 -2.261833 -0.196583
C  2.557827 0.20932 0.960137
C  4.777205 -0.448892 0.037204
C  -5.612355 -0.01838 1.776505
C  -6.052431 -0.48828 -0.530256
C  9.438876 -2.067848 -0.977166
C  -6.386544 -0.625937 0.804146
C  3.539214 -0.546287 -2.648762
C  10.368491 -3.188005 -0.544237
H  -1.816818 0.513546 1.175723
H  -1.28134 2.179548 1.068571
H  6.300671 -2.83159 1.707418
H  -4.70428 0.348193 -1.949318
H  -3.899417 1.168923 2.198794
H  7.211154 0.072954 1.524635
H  7.503165 -1.091865 2.836408
H  0.976438 0.177389 -2.53891
H  0.655582 0.848783 1.686364
H  4.300437 -1.904766 1.377938
H  2.999352 0.222824 1.948826
H  9.004631 -2.285089 -1.952522
H  9.981814 -1.125587 -1.073754
H  4.216784 0.245908 -2.967996
H  4.141209 -1.44026 -2.482773
H  2.863367 -0.752672 -3.477435
H  9.838485 -4.138551 -0.479158
H  10.832823 -2.984015 0.420455
H  11.167488 -3.298107 -1.277608
elementType: Cl F O N C H
totalener: -2673.00626005 hartree
nucrepener: 4098.30400564 hartree
electener: -6771.31026569 hartree
twoeener: 5056.41020959 hartree
cpcmener: -0.05452231 hartree
kineticenergy: 2664.88983568 hartree
xcener: -201.535997459641 hartree
chargesum: -0.0000000
charge: -0.054465 -0.055286 -0.174538 -0.172775 -0.169018 -0.184637 -0.238354 -0.280754 -0.519560 -0.496315 -0.121335 -0.199149 0.050299 0.241436 -0.072436 0.197046 -0.024656 0.477178 -0.081845 0.132365 -0.150696 -0.174899 0.002138 -0.113938 0.061652 -0.072385 -0.166010 0.242119 -0.190470 0.352869 0.024719 0.036432 -0.023229 0.197306 -0.249691 -0.243868 0.128392 0.118746 0.113647 0.130796 0.139216 0.097923 0.107085 0.128229 0.146795 0.182768 0.148630 0.089236 0.106575 0.106356 0.102275 0.097616 0.088111 0.088740 0.093615
qa: -0.0545 -0.0553 -0.1745 -0.1728 -0.1690 -0.1846 -0.2384 -0.2808 -0.5196 -0.4963 -0.1213 -0.1991 0.0503 0.2414 -0.0724 0.1970 -0.0247 0.4772 -0.0818 0.1324 -0.1507 -0.1749 0.0021 -0.1139 0.0617 -0.0724 -0.1660 0.2421 -0.1905 0.3529 0.0247 0.0364 -0.0232 0.1973 -0.2497 -0.2439 0.1284 0.1187 0.1136 0.1308 0.1392 0.0979 0.1071 0.1282 0.1468 0.1828 0.1486 0.0892 0.1066 0.1064 0.1023 0.0976 0.0881 0.0887 0.0936
va: 1.2474 1.2448 1.1369 1.1427 1.1444 1.1337 1.9923 1.8835 1.9964 2.0049 2.9872 3.2202 3.1177 3.9053 3.9090 3.8494 3.8095 4.4800 3.8170 3.8262 4.0766 4.0783 3.9806 3.9450 3.5912 3.8722 3.9721 4.2245 4.0216 4.1487 3.8932 3.8676 3.8879 4.1560 3.9252 3.9114 1.0069 1.0220 1.0112 1.0410 1.0233 1.0107 0.9923 1.0366 1.0039 1.0035 1.0150 1.0169 1.0009 1.0040 1.0083 1.0048 1.0042 1.0083 1.0064
dispcorr: -0.029574665 hartree
energy: -2673.035834717834
dipole: 109.65753 -108.11626 1.54127 -22.28359 21.59982 -0.68377 -4.75411 8.30245 3.54834
magnitude: 3.92858 au
magnitude: 9.98567 debye
