program: Orca
programVersion: 5.0.2
elementType: Cl Cl F F F F O O O O N N N C C C C C C C C C C C C C C C C C C C C C C C H H H H H H H H H H H H H H H H H H H
charge: 0
multiplicity: 1
keywords: wb97x-d3
keywords: def2-TZVPP
keywords: def2/J RIJCOSX
keywords: DEFGRID2
keywords: scfconv7
keywords: smallprint printgap noloewdin
keywords: NOSOSCF
formula: C23H19Cl2F4N3O4
InChI: InChI=1/C23H19Cl2F4N3O4/c1-3-32-21(34)18(10-35-32)30-20(33)14-5-4-12(6-11(14)2)17-9-22(36-31-17,23(27,28)29)13-7-15(24)19(26)16(25)8-13/h4-8,18,30H,3,9-10H2,1-2H3
55 atoms
Cl -5.454376 1.732194 3.653891
Cl -6.70597 -2.168512 0.231887
F  -3.842949 3.513545 -0.924796
F  -2.665818 2.929767 -2.631645
F  -4.654729 2.149762 -2.380767
F  -6.846025 -0.616104 2.671678
O  -2.692961 0.309082 -1.90694
O  8.99175 -0.983001 -0.06346
O  6.731452 -2.900068 -1.823844
O  4.741797 -1.092913 2.071114
N  -1.434482 -0.19755 -1.709237
N  5.40702 -0.982324 -0.081455
N  8.590819 -1.756074 -1.149984
C  -2.986761 1.307774 -0.929911
C  -1.635069 1.604791 -0.268451
C  -0.827121 0.47079 -0.815169
C  -4.036337 0.790582 0.04064
C  -3.5421 2.490052 -1.727475
C  0.536348 0.139099 -0.40385
C  6.735873 -1.451742 0.160244
C  -4.803929 -0.318735 -0.288573
C  -4.242081 1.43667 1.254408
C  7.788354 -0.379458 0.406409
C  1.12614 0.82429 0.654688
C  3.124142 -0.470259 0.438999
C  2.410614 0.532074 1.104416
C  1.261769 -0.860245 -1.051532
C  7.315961 -2.152677 -1.060302
C  2.545458 -1.147862 -0.634342
C  4.488664 -0.870664 0.897143
C  -5.192445 0.961234 2.140177
C  -5.751439 -0.789059 0.60495
C  9.659394 -2.322609 -1.929457
C  -5.945051 -0.154022 1.817495
C  2.971056 1.305612 2.262295
C  10.46092 -3.374874 -1.182302
H  -1.686759 1.588793 0.818992
H  -1.192136 2.562077 -0.554694
H  6.721213 -2.174935 0.981943
H  -4.669997 -0.835611 -1.228053
H  -3.660347 2.303995 1.53699
H  7.559253 0.525112 -0.168537
H  7.932937 -0.123052 1.453823
H  0.578626 1.611368 1.15854
H  0.831208 -1.408869 -1.878279
H  5.162963 -0.700804 -1.020528
H  3.098547 -1.929398 -1.140868
H  9.193419 -2.751854 -2.815656
H  10.300724 -1.508349 -2.270401
H  3.9998 1.622433 2.091452
H  2.376276 2.200039 2.443795
H  2.961216 0.715858 3.179368
H  11.230501 -3.778762 -1.840395
H  9.825891 -4.201456 -0.862339
H  10.959787 -2.962685 -0.305529
elementType: Cl F O N C H
totalener: -2673.00711852 hartree
nucrepener: 4076.51828021 hartree
electener: -6749.52539873 hartree
twoeener: 5033.43510499 hartree
cpcmener: -0.04951624 hartree
kineticenergy: 2664.86858546 hartree
xcener: -201.528316358089 hartree
chargesum: 0.0000000
charge: -0.054456 -0.055846 -0.174034 -0.172082 -0.169474 -0.184418 -0.240126 -0.276869 -0.507194 -0.506597 -0.122926 -0.191934 0.032714 0.271289 -0.073818 0.213263 -0.066789 0.488923 -0.086210 0.082116 -0.135410 -0.183014 0.039098 -0.103627 0.050457 -0.064773 -0.176309 0.265452 -0.182692 0.369254 0.024726 0.030769 -0.019339 0.202169 -0.259071 -0.245448 0.120653 0.123302 0.101560 0.130172 0.136599 0.082628 0.109458 0.127030 0.147003 0.179643 0.145086 0.090494 0.106516 0.107366 0.094876 0.106108 0.093971 0.089564 0.090196
qa: -0.0545 -0.0558 -0.1740 -0.1721 -0.1695 -0.1844 -0.2401 -0.2769 -0.5072 -0.5066 -0.1229 -0.1919 0.0327 0.2713 -0.0738 0.2133 -0.0668 0.4889 -0.0862 0.0821 -0.1354 -0.1830 0.0391 -0.1036 0.0505 -0.0648 -0.1763 0.2655 -0.1827 0.3693 0.0247 0.0308 -0.0193 0.2022 -0.2591 -0.2454 0.1207 0.1233 0.1016 0.1302 0.1366 0.0826 0.1095 0.1270 0.1470 0.1796 0.1451 0.0905 0.1065 0.1074 0.0949 0.1061 0.0940 0.0896 0.0902
va: 1.2472 1.2447 1.1366 1.1430 1.1454 1.1340 1.9888 1.8978 2.0169 2.0050 2.9862 3.2219 3.1450 3.8710 3.9343 3.8331 3.8388 4.4667 3.7954 3.8262 4.0592 4.1003 3.9552 3.9114 3.5992 3.8859 4.0253 4.2675 4.0006 4.1306 3.8873 3.8692 3.8846 4.1496 3.9289 3.9150 1.0071 1.0224 1.0319 1.0418 1.0240 1.0097 0.9978 1.0087 1.0246 1.0115 1.0257 1.0151 1.0011 0.9967 1.0047 1.0035 1.0067 1.0036 1.0079
dispcorr: -0.028768582 hartree
energy: -2673.035887104123
dipole: 109.25635 -106.45703 2.79932 -15.18270 17.37661 2.19390 -3.13910 3.24710 0.10800
magnitude: 3.55824 au
magnitude: 9.04434 debye
