program: Orca
programVersion: 5.0.2
elementType: Cl Cl F F F F O O O O N N N C C C C C C C C C C C C C C C C C C C C C C C H H H H H H H H H H H H H H H H H H H
charge: 0
multiplicity: 1
keywords: wb97x-d3
keywords: def2-TZVPP
keywords: def2/J RIJCOSX
keywords: DEFGRID2
keywords: scfconv7
keywords: smallprint printgap noloewdin
keywords: NOSOSCF
formula: C23H19Cl2F4N3O4
InChI: InChI=1/C23H19Cl2F4N3O4/c1-3-32-21(34)18(10-35-32)30-20(33)14-5-4-12(6-11(14)2)17-9-22(36-31-17,23(27,28)29)13-7-15(24)19(26)16(25)8-13/h4-8,18,30H,3,9-10H2,1-2H3
55 atoms
Cl -7.104384 -1.368671 -1.884645
Cl -5.897521 -0.736143 3.277016
F  -3.632923 3.316282 0.818463
F  -2.349026 3.678353 -0.873591
F  -4.407934 3.142838 -1.181043
F  -7.394137 -1.680469 0.981216
O  -2.568026 1.158383 -1.791444
O  8.355683 -2.288486 1.390822
O  7.44337 -0.461827 -1.395023
O  5.421651 0.010237 0.930332
N  -1.256557 0.770281 -1.86724
N  5.174664 -1.903172 -0.229816
N  8.534394 -1.316192 0.415671
C  -2.943632 1.428376 -0.438921
C  -1.672291 1.162264 0.377692
C  -0.730159 0.761864 -0.711286
C  -4.135927 0.574093 -0.057075
C  -3.339362 2.909793 -0.418819
C  0.663569 0.376286 -0.49689
C  6.533834 -2.326241 -0.072721
C  -4.425415 0.342762 1.281926
C  -4.96388 0.053275 -1.044187
C  6.975066 -2.660454 1.349214
C  1.505562 0.09227 -1.572065
C  3.310786 -0.379831 -0.07496
C  2.827231 -0.29215 -1.388129
C  1.168344 0.297493 0.797997
C  7.532617 -1.236957 -0.458861
C  2.487756 -0.064194 0.99924
C  4.728532 -0.727007 0.244514
C  -6.063608 -0.707427 -0.687336
C  -5.526148 -0.420558 1.628999
C  9.596639 -0.376568 0.65943
C  -6.344711 -0.945355 0.645744
C  3.685216 -0.570559 -2.589365
C  9.284094 0.580431 1.7962
H  -1.80126 0.355042 1.099479
H  -1.301452 2.026442 0.931624
H  6.687346 -3.177643 -0.739753
H  -3.798476 0.738613 2.069892
H  -4.76224 0.220929 -2.092707
H  6.407069 -2.100624 2.095247
H  6.917214 -3.72227 1.580678
H  1.126277 0.181555 -2.582624
H  0.546428 0.520909 1.654725
H  4.555941 -2.491715 -0.764381
H  2.876377 -0.113424 2.008417
H  10.516965 -0.931316 0.850161
H  9.742808 0.165178 -0.274378
H  3.783812 -1.641329 -2.778477
H  3.243105 -0.130042 -3.481706
H  4.691986 -0.166726 -2.484716
H  10.108082 1.283173 1.920888
H  9.150228 0.055815 2.741955
H  8.37987 1.153112 1.588618
elementType: Cl F O N C H
totalener: -2673.00515045 hartree
nucrepener: 4116.10765797 hartree
electener: -6789.11280842 hartree
twoeener: 5074.05975670 hartree
cpcmener: -0.05462977 hartree
kineticenergy: 2664.89534006 hartree
xcener: -201.537944778821 hartree
chargesum: -0.0000000
charge: -0.055506 -0.054363 -0.174364 -0.172582 -0.168789 -0.184385 -0.236694 -0.285585 -0.516057 -0.507432 -0.123615 -0.194226 0.040553 0.254236 -0.078437 0.204211 -0.035214 0.478022 -0.076032 0.148084 -0.173553 -0.153959 -0.010336 -0.119289 0.072374 -0.081244 -0.177663 0.231663 -0.188023 0.377753 0.036474 0.028743 -0.003262 0.197314 -0.269940 -0.252809 0.123028 0.120716 0.113598 0.139049 0.129956 0.101767 0.107993 0.128454 0.145052 0.181674 0.144331 0.104995 0.091636 0.107392 0.099939 0.110630 0.097716 0.087820 0.088186
qa: -0.0555 -0.0544 -0.1744 -0.1726 -0.1688 -0.1844 -0.2367 -0.2856 -0.5161 -0.5074 -0.1236 -0.1942 0.0406 0.2542 -0.0784 0.2042 -0.0352 0.4780 -0.0760 0.1481 -0.1736 -0.1540 -0.0103 -0.1193 0.0724 -0.0812 -0.1777 0.2317 -0.1880 0.3778 0.0365 0.0287 -0.0033 0.1973 -0.2699 -0.2528 0.1230 0.1207 0.1136 0.1390 0.1300 0.1018 0.1080 0.1285 0.1451 0.1817 0.1443 0.1050 0.0916 0.1074 0.0999 0.1106 0.0977 0.0878 0.0882
va: 1.2447 1.2477 1.1372 1.1427 1.1448 1.1342 1.9948 1.8818 1.9979 1.9911 2.9947 3.2376 3.1566 3.8835 3.9295 3.8328 3.8409 4.4808 3.8099 3.7695 4.0765 4.0845 3.9791 3.9541 3.5983 3.8607 3.9657 4.2770 4.0433 4.1177 3.8704 3.8854 3.8718 4.1560 3.9512 3.9218 1.0080 1.0215 1.0097 1.0217 1.0414 1.0112 0.9924 1.0354 1.0044 1.0013 1.0146 0.9992 1.0192 0.9917 1.0058 1.0083 1.0077 1.0074 1.0083
dispcorr: -0.030270791 hartree
energy: -2673.035421236949
dipole: 106.70895 -105.62000 1.08894 -12.19493 9.86403 -2.33090 1.31919 0.25128 1.57047
magnitude: 3.01417 au
magnitude: 7.66142 debye
