program: Orca
programVersion: 5.0.2
elementType: Cl Cl F F F F O O O O N N N C C C C C C C C C C C C C C C C C C C C C C C H H H H H H H H H H H H H H H H H H H
charge: 0
multiplicity: 1
keywords: wb97x-d3
keywords: def2-TZVPP
keywords: def2/J RIJCOSX
keywords: DEFGRID2
keywords: scfconv7
keywords: smallprint printgap noloewdin
keywords: NOSOSCF
formula: C23H19Cl2F4N3O4
InChI: InChI=1/C23H19Cl2F4N3O4/c1-3-32-21(34)18(10-35-32)30-20(33)14-5-4-12(6-11(14)2)17-9-22(36-31-17,23(27,28)29)13-7-15(24)19(26)16(25)8-13/h4-8,18,30H,3,9-10H2,1-2H3
55 atoms
Cl -5.920544 -0.566526 2.977262
Cl -6.997817 -0.629604 -2.25594
F  -2.131351 4.166589 -0.426547
F  -4.203409 3.782034 -0.868901
F  -3.47277 3.570992 1.149558
F  -7.382392 -1.228339 0.560135
O  -2.471477 1.844609 -1.788055
O  8.493101 -2.594443 -0.240395
O  5.867946 -3.241024 1.901545
O  5.825848 0.908377 -0.774878
N  -1.139222 1.591124 -1.928367
N  5.308747 -1.023867 0.250972
N  7.778102 -3.384823 0.646392
C  -2.834979 1.907729 -0.409771
C  -1.571213 1.472315 0.343301
C  -0.600876 1.392296 -0.795626
C  -4.053057 1.047471 -0.157212
C  -3.168924 3.381098 -0.139993
C  0.821655 1.094039 -0.659912
C  6.666719 -1.391363 0.507607
C  -4.863853 0.651208 -1.212151
C  -4.380787 0.675623 1.140347
C  7.551659 -1.628702 -0.706972
C  1.336514 0.714916 0.573782
C  3.524025 0.475859 -0.358147
C  2.679658 0.394825 0.751828
C  1.686206 1.196104 -1.749839
C  6.692315 -2.779552 1.141779
C  3.022755 0.905908 -1.586315
C  4.988148 0.166421 -0.304774
C  -5.504693 -0.094716 1.381592
C  -5.986767 -0.12167 -0.967127
C  8.251755 -4.72568 0.83366
C  -6.310023 -0.492192 0.327435
C  3.155848 0.017646 2.129221
C  8.114165 -5.583099 -0.414428
H  -1.69524 0.497631 0.820596
H  -1.247712 2.17273 1.115073
H  7.145686 -0.677368 1.190395
H  -4.628182 0.926346 -2.229677
H  -3.770315 0.973393 1.981964
H  6.959381 -2.029592 -1.538256
H  8.107038 -0.755786 -1.038165
H  0.68296 0.664749 1.436941
H  1.308654 1.514203 -2.711698
H  4.593437 -1.610592 0.651105
H  3.699918 1.00763 -2.423835
H  9.291528 -4.691368 1.167712
H  7.662353 -5.133963 1.654033
H  2.471618 0.402153 2.88421
H  3.205661 -1.063504 2.275759
H  4.142849 0.41917 2.351906
H  7.07128 -5.666249 -0.718593
H  8.488199 -6.587213 -0.21701
H  8.684903 -5.172609 -1.245705
totalener: -2672.96975728 hartree
nucrepener: 4087.11446268 hartree
electener: -6760.08421996 hartree
twoeener: 5044.14196773 hartree
kineticenergy: 2664.97499848 hartree
xcener: -201.541560419602 hartree
chargesum: 0.0000000
charge: -0.036226 -0.033844 -0.161041 -0.154004 -0.172552 -0.165130 -0.207686 -0.245991 -0.415693 -0.395336 -0.072722 -0.229705 0.022337 0.234705 -0.153042 0.174741 -0.030411 0.479030 -0.067617 0.091030 -0.145072 -0.177827 0.013360 -0.096883 0.099660 -0.117805 -0.148180 0.214954 -0.133709 0.284197 0.014360 0.035609 -0.025582 0.182419 -0.257561 -0.239844 0.112704 0.110527 0.089958 0.128346 0.121935 0.074532 0.114722 0.100101 0.138614 0.161821 0.129432 0.095224 0.096145 0.086670 0.101267 0.110194 0.083945 0.087789 0.093136
qa: -0.0362 -0.0338 -0.1610 -0.1540 -0.1726 -0.1651 -0.2077 -0.2460 -0.4157 -0.3953 -0.0727 -0.2297 0.0223 0.2347 -0.1530 0.1747 -0.0304 0.4790 -0.0676 0.0910 -0.1451 -0.1778 0.0134 -0.0969 0.0997 -0.1178 -0.1482 0.2150 -0.1337 0.2842 0.0144 0.0356 -0.0256 0.1824 -0.2576 -0.2398 0.1127 0.1105 0.0900 0.1283 0.1219 0.0745 0.1147 0.1001 0.1386 0.1618 0.1294 0.0952 0.0961 0.0867 0.1013 0.1102 0.0839 0.0878 0.0931
va: 1.2668 1.2664 1.1581 1.1677 1.1386 1.1601 2.0390 1.9083 2.1066 2.1232 3.0046 3.1753 3.1729 3.9435 3.9511 3.8246 3.8267 4.4630 3.8806 3.8253 4.0890 4.0655 3.9565 3.9116 3.6272 3.9359 4.0332 4.3018 4.0140 4.1901 3.9531 3.8976 3.8910 4.1444 3.9617 3.9120 1.0047 1.0187 1.0242 1.0426 1.0305 1.0094 1.0059 1.0144 1.0247 1.0407 1.0205 0.9981 1.0173 1.0062 1.0008 0.9981 1.0066 1.0104 1.0085
dispcorr: -0.029273700 hartree
energy: -2672.999030980645
dipole: 101.94055 -100.58199 1.35855 -31.75887 30.54535 -1.21352 3.57471 -2.84188 0.73283
magnitude: 1.96350 au
magnitude: 4.99083 debye
