program: Orca
programVersion: 5.0.2
elementType: Cl Cl F F F F O O O O N N N C C C C C C C C C C C C C C C C C C C C C C C H H H H H H H H H H H H H H H H H H H
charge: 0
multiplicity: 1
keywords: wb97x-d3
keywords: def2-TZVPP
keywords: def2/J RIJCOSX
keywords: DEFGRID2
keywords: scfconv7
keywords: smallprint printgap noloewdin
keywords: NOSOSCF
formula: C23H19Cl2F4N3O4
InChI: InChI=1/C23H19Cl2F4N3O4/c1-3-32-21(34)18(10-35-32)30-20(33)14-5-4-12(6-11(14)2)17-9-22(36-31-17,23(27,28)29)13-7-15(24)19(26)16(25)8-13/h4-8,18,30H,3,9-10H2,1-2H3
55 atoms
Cl -5.969649 1.005333 3.553041
Cl -6.828549 -1.968586 -0.799932
F  -2.399637 3.515176 -1.868312
F  -4.433586 2.825564 -2.050335
F  -3.762072 3.740109 -0.218611
F  -7.251597 -1.012647 1.905767
O  -2.596895 0.805372 -1.83893
O  8.879141 -1.539128 0.456347
O  6.307842 -3.791321 -0.002918
O  5.344307 0.8668 1.319827
N  -1.278562 0.466511 -1.783088
N  5.318975 -1.175048 0.383392
N  8.349443 -2.757514 0.061183
C  -2.983365 1.552782 -0.685133
C  -1.709893 1.636171 0.169005
C  -0.749436 0.899525 -0.713205
C  -4.146213 0.868615 0.004833
C  -3.404395 2.927315 -1.218515
C  0.65753 0.67207 -0.395211
C  6.608096 -1.531255 0.894448
C  -4.874037 -0.112323 -0.654492
C  -4.491512 1.223912 1.303327
C  7.768645 -0.644074 0.469117
C  1.510533 0.0638 -1.312825
C  3.341342 0.212495 0.22543
C  2.847871 -0.177239 -1.029444
C  1.171933 1.079145 0.831489
C  7.032165 -2.859575 0.273285
C  2.503053 0.859413 1.12675
C  4.753003 0.016501 0.684723
C  -5.541646 0.590023 1.944456
C  -5.924716 -0.744212 -0.009421
C  9.262785 -3.690828 -0.531723
C  -6.25769 -0.397643 1.288692
C  3.696927 -0.804084 -2.102799
C  9.792513 -3.226436 -1.879605
H  -1.827349 1.135211 1.131522
H  -1.373577 2.654677 0.372727
H  6.590964 -1.636142 1.988001
H  -4.625105 -0.406228 -1.66346
H  -3.947656 1.988263 1.841616
H  7.588318 -0.232342 -0.531433
H  8.000441 0.160146 1.161108
H  1.118264 -0.219913 -2.281273
H  0.543955 1.571811 1.562325
H  4.751675 -1.937164 0.043197
H  2.90527 1.191234 2.074153
H  10.084216 -3.877019 0.165217
H  8.706334 -4.622431 -0.631724
H  4.707145 -0.400442 -2.12446
H  3.78071 -1.886587 -1.983841
H  3.250768 -0.632108 -3.08088
H  10.470327 -3.974977 -2.289237
H  10.342928 -2.291038 -1.791731
H  8.978888 -3.083556 -2.590452
totalener: -2672.97048479 hartree
nucrepener: 4078.67823270 hartree
electener: -6751.64871749 hartree
twoeener: 5035.79044615 hartree
kineticenergy: 2664.96454397 hartree
xcener: -201.540608155438 hartree
chargesum: -0.0000000
charge: -0.035961 -0.034006 -0.162763 -0.153931 -0.172111 -0.165070 -0.208777 -0.245506 -0.415179 -0.406563 -0.077425 -0.230615 0.022247 0.225663 -0.140540 0.184227 -0.035078 0.482750 -0.079142 0.091502 -0.139426 -0.188169 0.011183 -0.095719 0.079727 -0.087410 -0.148928 0.216650 -0.153321 0.306555 0.017475 0.034946 -0.026607 0.184352 -0.250009 -0.238558 0.111573 0.112660 0.088846 0.128664 0.121327 0.076355 0.114622 0.120493 0.118769 0.161296 0.129136 0.095214 0.096154 0.101910 0.100112 0.093546 0.087194 0.092788 0.082881
qa: -0.0360 -0.0340 -0.1628 -0.1539 -0.1721 -0.1651 -0.2088 -0.2455 -0.4152 -0.4066 -0.0774 -0.2306 0.0222 0.2257 -0.1405 0.1842 -0.0351 0.4827 -0.0791 0.0915 -0.1394 -0.1882 0.0112 -0.0957 0.0797 -0.0874 -0.1489 0.2166 -0.1533 0.3066 0.0175 0.0349 -0.0266 0.1844 -0.2500 -0.2386 0.1116 0.1127 0.0888 0.1287 0.1213 0.0764 0.1146 0.1205 0.1188 0.1613 0.1291 0.0952 0.0962 0.1019 0.1001 0.0935 0.0872 0.0928 0.0829
va: 1.2669 1.2664 1.1560 1.1686 1.1383 1.1600 2.0367 1.9071 2.1092 2.1071 3.0099 3.1708 3.1691 3.9390 3.9427 3.8023 3.8274 4.4646 3.8839 3.8207 4.0795 4.0736 3.9743 3.9871 3.6764 3.8525 3.9673 4.3077 4.0988 4.1600 3.9480 3.8958 3.8897 4.1426 3.9508 3.9117 1.0054 1.0191 1.0201 1.0425 1.0311 1.0060 1.0061 1.0350 1.0108 1.0389 1.0258 0.9982 1.0175 1.0039 0.9978 1.0074 1.0105 1.0083 1.0070
dispcorr: -0.029159538 hartree
energy: -2672.999644324014
dipole: 109.16652 -107.48134 1.68518 -22.56373 22.39406 -0.16967 -9.96000 10.06023 0.10023
magnitude: 1.69666 au
magnitude: 4.31257 debye
