program: Orca
programVersion: 5.0.2
elementType: Cl Cl F F F F O O O O N N N C C C C C C C C C C C C C C C C C C C C C C C H H H H H H H H H H H H H H H H H H H
charge: 0
multiplicity: 1
keywords: wb97x-d3
keywords: def2-TZVPP
keywords: def2/J RIJCOSX
keywords: DEFGRID2
keywords: scfconv7
keywords: smallprint printgap noloewdin
keywords: NOSOSCF
formula: C23H19Cl2F4N3O4
InChI: InChI=1/C23H19Cl2F4N3O4/c1-3-32-21(34)18(10-35-32)30-20(33)14-5-4-12(6-11(14)2)17-9-22(36-31-17,23(27,28)29)13-7-15(24)19(26)16(25)8-13/h4-8,18,30H,3,9-10H2,1-2H3
55 atoms
Cl -5.992292 1.049461 3.529682
Cl -6.862113 -1.831731 -0.883356
F  -4.374849 2.956719 -2.038524
F  -3.719401 3.824226 -0.176653
F  -2.33562 3.611104 -1.81066
F  -7.286895 -0.923148 1.839575
O  -2.583543 0.905998 -1.842238
O  8.858995 -1.550064 0.31217
O  6.365553 -3.738104 -0.622921
O  5.258792 0.564826 1.555337
N  -1.275138 0.531226 -1.77464
N  5.296591 -1.267378 0.255175
N  8.355638 -2.62767 -0.4041
C  -2.969324 1.634253 -0.67612
C  -1.70553 1.670637 0.196248
C  -0.752515 0.925382 -0.686659
C  -4.15082 0.957133 -0.010535
C  -3.358709 3.026258 -1.187325
C  0.644802 0.657303 -0.357407
C  6.583053 -1.698726 0.712945
C  -4.88761 -0.00092 -0.692676
C  -4.499764 1.292506 1.292395
C  7.727383 -0.71107 0.532541
C  1.529948 0.190835 -1.325503
C  3.308778 0.110095 0.277269
C  2.86007 -0.08498 -1.03863
C  1.11738 0.882942 0.931316
C  7.052935 -2.846471 -0.175171
C  2.437665 0.616926 1.235738
C  4.703889 -0.157486 0.751334
C  -5.560593 0.659415 1.915716
C  -5.948961 -0.632746 -0.06506
C  9.325421 -3.502959 -0.997417
C  -6.284134 -0.307542 1.237962
C  3.747648 -0.528739 -2.171262
C  10.186222 -4.235372 0.02099
H  -1.852363 1.158714 1.14862
H  -1.341725 2.675326 0.42122
H  6.542273 -2.050902 1.752952
H  -4.636071 -0.278066 -1.705704
H  -3.949718 2.039206 1.848671
H  7.54621 -0.066934 -0.335648
H  7.936505 -0.099598 1.405313
H  1.170988 0.055619 -2.337911
H  0.463266 1.262861 1.705205
H  4.750355 -1.957135 -0.238249
H  2.807123 0.801643 2.235127
H  8.752721 -4.209109 -1.598367
H  9.944265 -2.919951 -1.682784
H  3.837799 -1.615597 -2.229008
H  3.329683 -0.20084 -3.121515
H  4.75441 -0.123223 -2.095935
H  10.889848 -4.888927 -0.494124
H  9.573789 -4.852632 0.678122
H  10.761322 -3.543216 0.63418
totalener: -2672.97025953 hartree
nucrepener: 4074.44004772 hartree
electener: -6747.41030725 hartree
twoeener: 5031.59084810 hartree
kineticenergy: 2664.96896349 hartree
xcener: -201.540364321659 hartree
chargesum: 0.0000000
charge: -0.036021 -0.033830 -0.154221 -0.172101 -0.163117 -0.165037 -0.208909 -0.243914 -0.411219 -0.407917 -0.077643 -0.225073 0.019604 0.230535 -0.136674 0.174305 -0.038555 0.484003 -0.068416 0.080239 -0.138489 -0.191716 0.022506 -0.093830 0.077200 -0.093186 -0.146258 0.224115 -0.156269 0.304221 0.019084 0.033923 -0.032582 0.184634 -0.247645 -0.236236 0.107729 0.117199 0.086946 0.128837 0.121489 0.074586 0.110548 0.118789 0.117207 0.161913 0.130656 0.093829 0.095286 0.099913 0.093251 0.102696 0.084316 0.085162 0.094138
qa: -0.0360 -0.0338 -0.1542 -0.1721 -0.1631 -0.1650 -0.2089 -0.2439 -0.4112 -0.4079 -0.0776 -0.2251 0.0196 0.2305 -0.1367 0.1743 -0.0386 0.4840 -0.0684 0.0802 -0.1385 -0.1917 0.0225 -0.0938 0.0772 -0.0932 -0.1463 0.2241 -0.1563 0.3042 0.0191 0.0339 -0.0326 0.1846 -0.2476 -0.2362 0.1077 0.1172 0.0869 0.1288 0.1215 0.0746 0.1105 0.1188 0.1172 0.1619 0.1307 0.0938 0.0953 0.0999 0.0933 0.1027 0.0843 0.0852 0.0941
va: 1.2669 1.2665 1.1687 1.1383 1.1552 1.1600 2.0373 1.9141 2.1125 2.1056 3.0013 3.1715 3.1541 3.9286 3.9423 3.8100 3.8286 4.4663 3.8523 3.8504 4.0802 4.0753 3.9800 3.9877 3.6778 3.8601 3.9673 4.2890 4.0990 4.1640 3.9461 3.8964 3.9037 4.1421 3.9466 3.9125 1.0066 1.0186 1.0194 1.0424 1.0311 1.0052 1.0055 1.0344 1.0108 1.0373 1.0259 1.0159 1.0007 0.9985 1.0072 1.0050 1.0088 1.0057 1.0080
dispcorr: -0.029100641 hartree
energy: -2672.999360175535
dipole: 110.19641 -108.48772 1.70869 -25.44753 25.29934 -0.14819 -5.48363 5.70543 0.22180
magnitude: 1.72939 au
magnitude: 4.39576 debye
