program: Orca
programVersion: 5.0.2
elementType: Cl Cl F F F F O O O O N N N C C C C C C C C C C C C C C C C C C C C C C C H H H H H H H H H H H H H H H H H H H
charge: 0
multiplicity: 1
keywords: wb97x-d3
keywords: def2-TZVPP
keywords: def2/J RIJCOSX
keywords: DEFGRID2
keywords: scfconv7
keywords: smallprint printgap noloewdin
keywords: NOSOSCF
formula: C23H19Cl2F4N3O4
InChI: InChI=1/C23H19Cl2F4N3O4/c1-3-32-21(34)18(10-35-32)30-20(33)14-5-4-12(6-11(14)2)17-9-22(36-31-17,23(27,28)29)13-7-15(24)19(26)16(25)8-13/h4-8,18,30H,3,9-10H2,1-2H3
55 atoms
Cl -6.966819 -1.378991 -1.669225
Cl -6.183487 0.155461 3.389532
F  -4.385203 3.317794 -1.401969
F  -3.762514 3.672352 0.629999
F  -2.360588 3.919087 -0.986481
F  -7.508838 -1.177204 1.172773
O  -2.548877 1.29174 -1.710551
O  8.943881 -1.46648 -0.058888
O  6.420709 -3.80475 -0.260097
O  5.42433 0.804447 1.191485
N  -1.236046 0.934122 -1.716751
N  5.382534 -1.175732 0.135973
N  8.402059 -2.677984 -0.47112
C  -2.963811 1.704842 -0.408796
C  -1.710072 1.548758 0.465684
C  -0.730234 1.058795 -0.558781
C  -4.161022 0.887106 0.028189
C  -3.376224 3.175949 -0.551282
C  0.672419 0.743085 -0.296019
C  6.712926 -1.511721 0.548743
C  -4.554009 0.877077 1.360702
C  -4.90738 0.192284 -0.913978
C  7.821542 -0.59638 0.048988
C  1.475058 0.183976 -1.288327
C  3.371557 0.188502 0.176434
C  2.816404 -0.10622 -1.078756
C  1.240204 1.028839 0.94114
C  7.123802 -2.833626 -0.090062
C  2.579446 0.769823 1.160859
C  4.809755 -0.017794 0.542466
C  -6.034037 -0.509941 -0.521933
C  -5.683036 0.176409 1.748777
C  9.345688 -3.682443 -0.871048
C  -6.426904 -0.513298 0.805829
C  3.603507 -0.681986 -2.225199
C  10.264686 -4.132878 0.254978
H  -1.847561 0.815902 1.262704
H  -1.379585 2.477749 0.93426
H  6.776279 -1.619794 1.640351
H  -3.99592 1.412881 2.116575
H  -4.620862 0.184091 -1.955324
H  7.557658 -0.176135 -0.929107
H  8.087993 0.203573 0.733602
H  1.039276 -0.020337 -2.258032
H  0.652287 1.473021 1.733876
H  4.809847 -1.937418 -0.194691
H  3.025768 1.026256 2.1119
H  8.74817 -4.516071 -1.23907
H  9.923038 -3.298923 -1.714589
H  4.609279 -0.271774 -2.288614
H  3.698712 -1.767685 -2.155661
H  3.101016 -0.473513 -3.167872
H  10.936709 -4.91069 -0.106214
H  9.69223 -4.544051 1.085755
H  10.874739 -3.312665 0.629122
totalener: -2672.97012649 hartree
nucrepener: 4066.43493911 hartree
electener: -6739.40506560 hartree
twoeener: 5023.58170329 hartree
kineticenergy: 2664.95745374 hartree
xcener: -201.537337977729 hartree
chargesum: -0.0000000
charge: -0.034189 -0.036246 -0.153600 -0.172062 -0.162114 -0.165249 -0.208356 -0.244048 -0.407425 -0.403551 -0.078987 -0.225191 0.015901 0.220730 -0.146501 0.189103 -0.028875 0.482606 -0.072909 0.077624 -0.183641 -0.140945 0.025421 -0.096715 0.067856 -0.081629 -0.155948 0.222774 -0.146619 0.312460 0.035031 0.014001 -0.034793 0.184172 -0.249119 -0.237651 0.117312 0.107597 0.086618 0.119804 0.128372 0.069142 0.112756 0.120230 0.118790 0.159405 0.128954 0.094995 0.096104 0.102636 0.098345 0.092972 0.083895 0.085555 0.095199
qa: -0.0342 -0.0362 -0.1536 -0.1721 -0.1621 -0.1652 -0.2084 -0.2440 -0.4074 -0.4036 -0.0790 -0.2252 0.0159 0.2207 -0.1465 0.1891 -0.0289 0.4826 -0.0729 0.0776 -0.1836 -0.1409 0.0254 -0.0967 0.0679 -0.0816 -0.1559 0.2228 -0.1466 0.3125 0.0350 0.0140 -0.0348 0.1842 -0.2491 -0.2377 0.1173 0.1076 0.0866 0.1198 0.1284 0.0691 0.1128 0.1202 0.1188 0.1594 0.1290 0.0950 0.0961 0.1026 0.0983 0.0930 0.0839 0.0856 0.0952
va: 1.2664 1.2663 1.1687 1.1388 1.1565 1.1600 2.0367 1.9179 2.1167 2.1108 3.0068 3.1715 3.1475 3.9511 3.9348 3.7992 3.8247 4.4584 3.8807 3.8567 4.0807 4.0780 3.9682 3.9825 3.6815 3.8513 3.9815 4.2850 4.0951 4.1556 3.8990 3.9596 3.9054 4.1435 3.9508 3.9139 1.0061 1.0221 1.0218 1.0315 1.0433 1.0068 1.0052 1.0361 1.0114 1.0387 1.0253 1.0156 1.0003 1.0030 0.9969 1.0083 1.0090 1.0054 1.0079
dispcorr: -0.029033202 hartree
energy: -2672.999159692656
dipole: 111.38154 -109.72298 1.65856 -25.62426 25.19426 -0.43000 -5.21903 5.47852 0.25949
magnitude: 1.73293 au
magnitude: 4.40476 debye
