program: Orca
programVersion: 5.0.2
elementType: Cl Cl F F F F O O O O N N N C C C C C C C C C C C C C C C C C C C C C C C H H H H H H H H H H H H H H H H H H H
charge: 0
multiplicity: 1
keywords: wb97x-d3
keywords: def2-TZVPP
keywords: def2/J RIJCOSX
keywords: DEFGRID2
keywords: scfconv7
keywords: smallprint printgap noloewdin
keywords: NOSOSCF
formula: C23H19Cl2F4N3O4
InChI: InChI=1/C23H19Cl2F4N3O4/c1-3-32-21(34)18(10-35-32)30-20(33)14-5-4-12(6-11(14)2)17-9-22(36-31-17,23(27,28)29)13-7-15(24)19(26)16(25)8-13/h4-8,18,30H,3,9-10H2,1-2H3
55 atoms
Cl -7.373491 -1.521495 -1.247779
Cl -6.281388 0.980775 3.342825
F  -3.278326 3.323469 -0.117317
F  -1.83102 2.8872 -1.649016
F  -3.930587 2.608772 -2.042901
F  -7.830064 -0.602626 1.46046
O  -2.540788 0.253649 -1.745406
O  8.943009 -0.558885 0.976765
O  7.380952 -1.191142 -2.033345
O  4.838811 -1.651422 2.176184
N  -1.286051 -0.263609 -1.623747
N  5.529965 -1.185889 0.090264
N  8.877145 -0.593675 -0.407622
C  -2.881579 1.043035 -0.605787
C  -1.693111 0.875129 0.351495
C  -0.778217 0.052517 -0.503556
C  -4.212646 0.588971 -0.046734
C  -2.985947 2.485721 -1.11834
C  0.565611 -0.367098 -0.11693
C  6.906406 -1.472451 0.354363
C  -4.58823 0.953699 1.240029
C  -5.073718 -0.17294 -0.824328
C  7.585219 -0.614191 1.41354
C  1.323137 -1.194189 -0.943347
C  3.171514 -1.086572 0.575508
C  2.620188 -1.566792 -0.621761
C  1.112156 0.058559 1.089256
C  7.728266 -1.094721 -0.875795
C  2.398553 -0.311267 1.43139
C  4.572539 -1.362427 1.027032
C  -6.295194 -0.574096 -0.309745
C  -5.8092 0.549383 1.751358
C  9.967999 0.009866 -1.117359
C  -6.664624 -0.213692 0.97455
C  3.350054 -2.496703 -1.554492
C  10.024875 1.51991 -0.947752
H  -1.966891 0.334804 1.260002
H  -1.236301 1.816789 0.660657
H  7.053721 -2.537915 0.5737
H  -3.94018 1.550285 1.867607
H  -4.803253 -0.472255 -1.826156
H  7.14122 0.388156 1.432995
H  7.576188 -1.039415 2.412985
H  0.882776 -1.559398 -1.862555
H  0.544338 0.681208 1.768322
H  5.286449 -0.958336 -0.860835
H  2.819179 0.013609 2.373413
H  10.901689 -0.454068 -0.791058
H  9.823078 -0.258488 -2.163404
H  2.63744 -3.068196 -2.1467
H  3.987627 -1.96532 -2.264836
H  3.978777 -3.209211 -1.023292
H  10.865998 1.924428 -1.510242
H  10.15684 1.79953 0.096255
H  9.114716 1.989156 -1.319937
totalener: -2672.97024032 hartree
nucrepener: 4077.09677594 hartree
electener: -6750.06701626 hartree
twoeener: 5034.22613328 hartree
kineticenergy: 2664.97430820 hartree
xcener: -201.542521090057 hartree
chargesum: 0.0000000
charge: -0.034011 -0.035780 -0.172110 -0.162600 -0.154104 -0.164981 -0.208328 -0.246070 -0.414306 -0.402787 -0.077480 -0.231571 0.020810 0.220971 -0.149030 0.183681 -0.023652 0.481267 -0.076443 0.095063 -0.180990 -0.144599 0.011665 -0.093595 0.099434 -0.095387 -0.146250 0.213121 -0.163136 0.291780 0.036147 0.015494 -0.025413 0.181523 -0.255202 -0.240599 0.119056 0.107181 0.090189 0.120496 0.127758 0.074639 0.113780 0.120733 0.118015 0.165143 0.128706 0.096342 0.096338 0.092963 0.100545 0.110961 0.087798 0.092407 0.084419
qa: -0.0340 -0.0358 -0.1721 -0.1626 -0.1541 -0.1650 -0.2083 -0.2461 -0.4143 -0.4028 -0.0775 -0.2316 0.0208 0.2210 -0.1490 0.1837 -0.0237 0.4813 -0.0764 0.0951 -0.1810 -0.1446 0.0117 -0.0936 0.0994 -0.0954 -0.1462 0.2131 -0.1631 0.2918 0.0361 0.0155 -0.0254 0.1815 -0.2552 -0.2406 0.1191 0.1072 0.0902 0.1205 0.1278 0.0746 0.1138 0.1207 0.1180 0.1651 0.1287 0.0963 0.0963 0.0930 0.1005 0.1110 0.0878 0.0924 0.0844
va: 1.2666 1.2669 1.1390 1.1554 1.1684 1.1602 2.0362 1.9080 2.1068 2.1149 3.0085 3.1810 3.1732 3.9456 3.9408 3.8054 3.8217 4.4635 3.8813 3.8254 4.0701 4.0860 3.9594 3.9719 3.6354 3.8569 3.9638 4.3050 4.0999 4.1796 3.8970 3.9527 3.8919 4.1457 3.9557 3.9126 1.0046 1.0210 1.0231 1.0309 1.0431 1.0083 1.0055 1.0350 1.0113 1.0391 1.0242 0.9983 1.0172 1.0057 1.0007 0.9986 1.0105 1.0080 1.0065
dispcorr: -0.029163851 hartree
energy: -2672.999404168338
dipole: 110.07087 -108.38108 1.68979 -11.66245 12.21900 0.55654 -3.70157 4.13935 0.43778
magnitude: 1.83215 au
magnitude: 4.65697 debye
