program: Orca
programVersion: 5.0.2
elementType: Cl Cl F F F F O O O O N N N C C C C C C C C C C C C C C C C C C C C C C C H H H H H H H H H H H H H H H H H H H
charge: 0
multiplicity: 1
keywords: wb97x-d3
keywords: def2-TZVPP
keywords: def2/J RIJCOSX
keywords: DEFGRID2
keywords: scfconv7
keywords: smallprint printgap noloewdin
keywords: NOSOSCF
formula: C23H19Cl2F4N3O4
InChI: InChI=1/C23H19Cl2F4N3O4/c1-3-32-21(34)18(10-35-32)30-20(33)14-5-4-12(6-11(14)2)17-9-22(36-31-17,23(27,28)29)13-7-15(24)19(26)16(25)8-13/h4-8,18,30H,3,9-10H2,1-2H3
55 atoms
Cl -7.310498 -1.642891 -1.162257
Cl -6.204581 0.92185 3.390343
F  -3.353976 3.342752 -0.144425
F  -1.933083 2.945193 -1.712297
F  -4.030705 2.597018 -2.050397
F  -7.738595 -0.723182 1.550807
O  -2.554305 0.292779 -1.778771
O  9.008681 -1.149161 0.503417
O  7.183926 -1.339867 -2.416018
O  4.922111 -1.743619 1.955659
N  -1.28734 -0.196195 -1.677511
N  5.490978 -1.259723 -0.162553
N  8.848202 -1.065474 -0.870492
C  -2.894705 1.074284 -0.632999
C  -1.679495 0.948083 0.297489
C  -0.764408 0.13843 -0.569632
C  -4.196501 0.577943 -0.041377
C  -3.059749 2.509685 -1.149404
C  0.593844 -0.259249 -0.210587
C  6.831727 -1.741881 -0.025173
C  -4.5562 0.938098 1.251251
C  -5.047996 -0.217174 -0.795867
C  7.687897 -1.063814 1.036319
C  1.147046 0.15585 0.996488
C  3.202935 -0.954471 0.499467
C  2.439828 -0.18277 1.381027
C  1.360721 -1.046731 -1.066307
C  7.614555 -1.378291 -1.283964
C  2.649906 -1.379541 -0.708348
C  4.598388 -1.360964 0.848864
C  -6.24409 -0.655519 -0.252797
C  -5.751558 0.49652 1.791356
C  9.951751 -0.531158 -1.614485
C  -6.59755 -0.299264 1.037363
C  2.96221 0.303047 2.701891
C  10.19946 0.941954 -1.331703
H  -1.919212 0.41372 1.219049
H  -1.238352 1.90448 0.583762
H  6.848051 -2.83123 0.109755
H  -3.915062 1.559679 1.861262
H  -4.789259 -0.513499 -1.801618
H  7.384219 -0.016898 1.158778
H  7.688279 -1.56063 2.002144
H  0.563023 0.76994 1.671787
H  0.947195 -1.391599 -2.003681
H  5.205486 -0.950748 -1.079333
H  3.227767 -2.007296 -1.375576
H  10.843755 -1.124371 -1.400774
H  9.703231 -0.689017 -2.663537
H  2.281341 1.034744 3.134606
H  3.075485 -0.516762 3.40864
H  3.939178 0.775199 2.607746
H  9.326375 1.540496 -1.589549
H  11.039024 1.298342 -1.92791
H  10.438951 1.112754 -0.283441
totalener: -2672.97186026 hartree
nucrepener: 4074.58655960 hartree
electener: -6747.55841986 hartree
twoeener: 5031.71367552 hartree
kineticenergy: 2664.98010267 hartree
xcener: -201.543471404718 hartree
chargesum: 0.0000000
charge: -0.033499 -0.035913 -0.172316 -0.162436 -0.153876 -0.164923 -0.207877 -0.246560 -0.411176 -0.410999 -0.073693 -0.222202 0.017593 0.225390 -0.154026 0.183582 -0.025279 0.481093 -0.075372 0.095931 -0.182345 -0.143334 0.012306 -0.085497 0.082238 -0.083281 -0.152001 0.212621 -0.173218 0.294177 0.035615 0.015421 -0.023585 0.182511 -0.229163 -0.241466 0.117860 0.107554 0.091949 0.120217 0.128015 0.072988 0.113313 0.098701 0.140610 0.156176 0.133466 0.095644 0.096330 0.075902 0.117717 0.094463 0.084378 0.088152 0.092128
qa: -0.0335 -0.0359 -0.1723 -0.1624 -0.1539 -0.1649 -0.2079 -0.2466 -0.4112 -0.4110 -0.0737 -0.2222 0.0176 0.2254 -0.1540 0.1836 -0.0253 0.4811 -0.0754 0.0959 -0.1823 -0.1433 0.0123 -0.0855 0.0822 -0.0833 -0.1520 0.2126 -0.1732 0.2942 0.0356 0.0154 -0.0236 0.1825 -0.2292 -0.2415 0.1179 0.1076 0.0919 0.1202 0.1280 0.0730 0.1133 0.0987 0.1406 0.1562 0.1335 0.0956 0.0963 0.0759 0.1177 0.0945 0.0844 0.0882 0.0921
va: 1.2672 1.2668 1.1386 1.1558 1.1687 1.1603 2.0383 1.9085 2.1121 2.0982 3.0097 3.1838 3.1685 3.9449 3.9472 3.8159 3.8254 4.4636 3.8905 3.8305 4.0707 4.0843 3.9588 3.8853 3.6166 4.0075 4.0734 4.3074 3.9972 4.1705 3.8981 3.9532 3.8919 4.1445 3.9449 3.9125 1.0046 1.0203 1.0231 1.0310 1.0429 1.0082 1.0061 1.0158 1.0264 1.0466 1.0231 0.9982 1.0176 1.0054 1.0044 1.0003 1.0064 1.0107 1.0080
dispcorr: -0.028862063 hartree
energy: -2673.000722323247
dipole: 109.88021 -108.18129 1.69892 -7.66090 8.33742 0.67652 2.59987 -1.85856 0.74132
magnitude: 1.97321 au
magnitude: 5.01550 debye
