program: Orca
programVersion: 5.0.2
elementType: Cl Cl F F F O O O N N N C C C C C C C C C C C C C C C C C C C C H H H H H H H H H H H H H H H H
charge: 0
multiplicity: 1
keywords: wb97x-d3
keywords: def2-TZVPP
keywords: def2/J RIJCOSX
keywords: DEFGRID2
keywords: scfconv7
keywords: smallprint printgap noloewdin
keywords: NOSOSCF
formula: C20H16Cl2F3N3O3
InChI: InChI=1/C20H16Cl2F3N3O3/c1-11-5-12(3-4-16(11)18(29)26-10-27-30-2)17-9-19(31-28-17,20(23,24)25)13-6-14(21)8-15(22)7-13/h3-8,10,26H,9H2,1-2H3
47 atoms
Cl 5.324373 3.505275 -0.723672
Cl 5.870739 -1.355921 -2.924005
F  3.487722 0.285539 2.851664
F  2.100258 -1.347191 3.061599
F  4.02426 -1.679665 2.155535
O  1.936606 -1.754062 0.39701
O  -6.00464 1.155553 1.601148
O  -9.41775 0.488764 -1.744596
N  0.568586 -1.762758 0.354719
N  -6.201419 0.223675 -0.452082
N  -8.086962 0.163345 -1.719687
C  2.421433 -0.497859 0.877572
C  1.170385 0.382983 0.986179
C  3.496556 0.03175 -0.047368
C  0.108711 -0.623486 0.677862
C  3.01827 -0.81149 2.254159
C  -1.327403 -0.354039 0.692069
C  4.119428 -0.816367 -0.953791
C  3.870901 1.368696 0.030272
C  -2.245191 -1.363228 0.405261
C  -1.7957 0.920781 0.995591
C  -3.612599 -1.127656 0.376243
C  4.861389 1.842686 -0.812731
C  5.103185 -0.306003 -1.785377
C  -4.063522 0.170522 0.658084
C  -3.155875 1.170348 0.991214
C  5.492541 1.020964 -1.731816
C  -4.535315 -2.273162 0.071193
C  -5.506489 0.551843 0.669741
C  -7.543476 0.486998 -0.62263
C  -9.984438 0.072228 -2.969055
H  1.166672 1.185221 0.245776
H  1.032113 0.851307 1.961859
H  3.843809 -1.858394 -1.0289
H  3.391841 2.044867 0.726229
H  -1.888765 -2.365737 0.203817
H  -1.112266 1.723878 1.237894
H  -3.511826 2.163936 1.231339
H  6.260965 1.40505 -2.388337
H  -4.043253 -3.220108 0.287516
H  -4.817568 -2.298637 -0.983423
H  -5.453705 -2.24064 0.656309
H  -5.715924 -0.207931 -1.227324
H  -8.057685 0.960137 0.207671
H  -9.927897 -1.011992 -3.098856
H  -9.510068 0.557402 -3.826273
H  -11.03215 0.367017 -2.93526
elementType: Cl F O N C H
totalener: -2381.75110116 hartree
nucrepener: 3228.02637811 hartree
electener: -5609.77747927 hartree
oneelecener: -9691.14177501 hartree
twoeener: 4081.36429574 hartree
cpcmener: -0.03940784 hartree
kineticenergy: 2374.73462287 hartree
xcener: -175.955611736789 hartree
chargesum: 0.0000000
charge: -0.073722 -0.074665 -0.173910 -0.173096 -0.168845 -0.236464 -0.476181 -0.248560 -0.118534 -0.146393 -0.177847 0.244157 -0.072793 0.001899 0.193114 0.474213 -0.076575 -0.184837 -0.206039 -0.120354 -0.173629 -0.087508 0.079479 0.095024 0.075275 -0.176898 -0.146078 -0.266353 0.371532 0.125800 -0.102940 0.130493 0.120824 0.130691 0.139259 0.128591 0.146934 0.144187 0.129694 0.101962 0.112284 0.115780 0.186510 0.119852 0.101021 0.100084 0.113560
qa: -0.0737 -0.0747 -0.1739 -0.1731 -0.1688 -0.2365 -0.4762 -0.2486 -0.1185 -0.1464 -0.1778 0.2442 -0.0728 0.0019 0.1931 0.4742 -0.0766 -0.1848 -0.2060 -0.1204 -0.1736 -0.0875 0.0795 0.0950 0.0753 -0.1769 -0.1461 -0.2664 0.3715 0.1258 -0.1029 0.1305 0.1208 0.1307 0.1393 0.1286 0.1469 0.1442 0.1297 0.1020 0.1123 0.1158 0.1865 0.1199 0.1010 0.1001 0.1136
va: 1.2306 1.2283 1.1387 1.1416 1.1453 1.9972 2.0330 1.9242 2.9875 3.2227 2.9004 3.9055 3.9076 3.7669 3.8424 4.4837 3.8082 4.0890 4.0795 3.9508 3.9785 3.8912 3.9370 3.9091 3.5857 4.0412 4.0591 3.9424 4.1177 4.1071 3.8969 1.0064 1.0203 1.0389 1.0211 1.0355 1.0036 1.0147 1.0166 1.0035 0.9903 0.9954 1.0091 1.0435 0.9936 0.9943 0.9939
dispcorr: -0.023262036 hartree
energy: -2381.774363193028
dipole: -70.53871 70.05968 -0.47904 -2.16421 2.84134 0.67713 -10.83605 9.60390 -1.23215
magnitude: 1.48532 au
magnitude: 3.77537 debye
