program: Orca
programVersion: 5.0.2
elementType: Cl Cl F F F O O O N N N C C C C C C C C C C C C C C C C C C C C H H H H H H H H H H H H H H H H
charge: 0
multiplicity: 1
keywords: wb97x-d3
keywords: def2-TZVPP
keywords: def2/J RIJCOSX
keywords: DEFGRID2
keywords: scfconv7
keywords: smallprint printgap noloewdin
keywords: NOSOSCF
formula: C20H16Cl2F3N3O3
InChI: InChI=1/C20H16Cl2F3N3O3/c1-11-5-12(3-4-16(11)18(29)26-10-27-30-2)17-9-19(31-28-17,20(23,24)25)13-6-14(21)8-15(22)7-13/h3-8,10,26H,9H2,1-2H3
47 atoms
Cl 6.318518 -2.505808 -1.43455
Cl 5.758474 2.829684 -1.560138
F  3.07009 1.399241 2.531154
F  1.514602 0.037357 3.129247
F  3.526762 -0.678975 2.865605
O  1.820925 -1.499776 0.908115
O  -5.654683 1.385749 -2.077929
O  -9.783649 0.212078 0.135592
N  0.493839 -1.539573 0.57546
N  -6.329597 0.208241 -0.265335
N  -8.47508 -0.065046 0.43426
C  2.305047 -0.155919 0.90702
C  1.131965 0.67841 0.377011
C  3.572246 -0.061004 0.084317
C  0.074291 -0.375608 0.28791
C  2.610132 0.155415 2.376585
C  -1.313012 -0.134992 -0.102765
C  4.030452 1.188683 -0.316487
C  4.283081 -1.206109 -0.250916
C  -2.221629 -1.188499 -0.198103
C  -1.744357 1.158303 -0.383139
C  -3.554697 -0.983118 -0.524724
C  5.440353 -1.081516 -1.002254
C  5.193665 1.275511 -1.060283
C  -3.97771 0.332085 -0.768676
C  -3.064935 1.380845 -0.727151
C  5.916552 0.149618 -1.417873
C  -4.466655 -2.173267 -0.624813
C  -5.384591 0.685771 -1.120635
C  -7.682433 0.409883 -0.43186
C  -10.62456 -0.357757 1.11695
H  1.337713 1.098887 -0.608665
H  0.839546 1.507879 1.022214
H  3.485836 2.090439 -0.069347
H  3.943192 -2.185858 0.052918
H  -1.882029 -2.200813 -0.016535
H  -1.062091 1.99691 -0.335269
H  -3.393691 2.389364 -0.943159
H  6.820119 0.229964 -2.006195
H  -3.889789 -3.074794 -0.820918
H  -5.200537 -2.074549 -1.423018
H  -5.013022 -2.345409 0.304221
H  -6.038347 -0.303218 0.557135
H  -7.986561 0.971143 -1.309647
H  -11.643173 -0.096354 0.834272
H  -10.422423 0.043725 2.113532
H  -10.537432 -1.447258 1.148542
elementType: Cl F O N C H
totalener: -2381.75104492 hartree
nucrepener: 3226.64898239 hartree
electener: -5608.40002731 hartree
oneelecener: -9688.39403591 hartree
twoeener: 4079.99400860 hartree
cpcmener: -0.03920852 hartree
kineticenergy: 2374.73724962 hartree
xcener: -175.956179215677 hartree
chargesum: -0.0000000
charge: -0.074853 -0.073710 -0.174182 -0.173185 -0.168761 -0.236098 -0.475304 -0.248642 -0.118196 -0.146139 -0.177315 0.243502 -0.074675 0.003712 0.194879 0.475495 -0.074652 -0.207459 -0.186992 -0.119196 -0.175185 -0.086171 0.098893 0.078865 0.071038 -0.175597 -0.146202 -0.267020 0.372263 0.124916 -0.103482 0.131581 0.119531 0.138050 0.129212 0.128982 0.146834 0.144608 0.128971 0.102095 0.115834 0.112464 0.185610 0.120404 0.113389 0.100978 0.100906
qa: -0.0749 -0.0737 -0.1742 -0.1732 -0.1688 -0.2361 -0.4753 -0.2486 -0.1182 -0.1461 -0.1773 0.2435 -0.0747 0.0037 0.1949 0.4755 -0.0747 -0.2075 -0.1870 -0.1192 -0.1752 -0.0862 0.0989 0.0789 0.0710 -0.1756 -0.1462 -0.2670 0.3723 0.1249 -0.1035 0.1316 0.1195 0.1381 0.1292 0.1290 0.1468 0.1446 0.1290 0.1021 0.1158 0.1125 0.1856 0.1204 0.1134 0.1010 0.1009
va: 1.2280 1.2308 1.1381 1.1410 1.1457 1.9975 2.0335 1.9242 2.9871 3.2212 2.9007 3.9088 3.9049 3.7652 3.8425 4.4828 3.8072 4.0794 4.0922 3.9496 3.9784 3.8871 3.9050 3.9388 3.5923 4.0409 4.0626 3.9430 4.1169 4.1071 3.8966 1.0063 1.0213 1.0222 1.0393 1.0353 1.0035 1.0143 1.0168 1.0036 0.9956 0.9905 1.0097 1.0432 0.9939 0.9941 0.9937
dispcorr: -0.023279353 hartree
energy: -2381.774324275472
dipole: -71.49863 70.84336 -0.65527 -4.34918 4.75801 0.40883 -5.35473 5.82630 0.47157
magnitude: 0.90493 au
magnitude: 2.30016 debye
