program: Orca
programVersion: 5.0.2
elementType: Cl Cl F F F O O O N N N C C C C C C C C C C C C C C C C C C C C H H H H H H H H H H H H H H H H
charge: 0
multiplicity: 1
keywords: wb97x-d3
keywords: def2-TZVPP
keywords: def2/J RIJCOSX
keywords: DEFGRID2
keywords: scfconv7
keywords: smallprint printgap noloewdin
keywords: NOSOSCF
formula: C20H16Cl2F3N3O3
InChI: InChI=1/C20H16Cl2F3N3O3/c1-11-5-12(3-4-16(11)18(29)26-10-27-30-2)17-9-19(31-28-17,20(23,24)25)13-6-14(21)8-15(22)7-13/h3-8,10,26H,9H2,1-2H3
47 atoms
Cl 5.28193 1.679406 -3.077098
Cl 4.854521 3.088247 2.08197
F  3.757444 -1.861189 2.130573
F  2.551776 -3.353335 1.154311
F  4.329806 -2.615615 0.195464
O  2.039145 -1.739387 -0.967207
O  -6.162552 -0.840879 1.461512
O  -9.086753 1.523834 -1.576907
N  0.674537 -1.728303 -1.059494
N  -6.023346 0.281394 -0.500511
N  -7.733665 1.309941 -1.583102
C  2.470834 -1.158909 0.265087
C  1.173605 -0.834244 1.019418
C  3.348836 0.048686 -0.005287
C  0.162618 -1.239384 -0.004921
C  3.287648 -2.260432 0.946744
C  -1.282638 -1.073956 0.135171
C  3.657782 0.918328 1.035285
C  3.858428 0.275851 -1.276629
C  -1.814061 -0.618492 1.338036
C  -2.142599 -1.338795 -0.929749
C  -3.179131 -0.412813 1.515718
C  4.660995 1.384973 -1.490955
C  4.470571 2.009998 0.786849
C  -4.022077 -0.653002 0.424804
C  -3.49574 -1.116745 -0.781225
C  4.984408 2.265416 -0.473756
C  -3.675049 0.08289 2.842143
C  -5.492752 -0.429511 0.533473
C  -7.363411 0.581469 -0.61558
C  -9.438479 2.359834 -2.659557
H  1.087969 0.225075 1.262976
H  1.043337 -1.386249 1.952589
H  3.262111 0.765485 2.030546
H  3.631109 -0.388387 -2.097778
H  -1.155277 -0.407007 2.171379
H  -1.758635 -1.698543 -1.874674
H  -4.152353 -1.321001 -1.618002
H  5.613468 3.125501 -0.656472
H  -2.840194 0.411691 3.460155
H  -4.201244 -0.698265 3.391919
H  -4.359641 0.925451 2.738225
H  -5.406149 0.659599 -1.207363
H  -8.024201 0.169639 0.140498
H  -10.517484 2.49557 -2.602103
H  -9.191558 1.906614 -3.6234
H  -8.956504 3.339057 -2.593399
elementType: Cl F O N C H
totalener: -2381.75165861 hartree
nucrepener: 3237.33645448 hartree
electener: -5619.08811309 hartree
oneelecener: -9709.69408260 hartree
twoeener: 4090.60596950 hartree
cpcmener: -0.03835656 hartree
kineticenergy: 2374.72950986 hartree
xcener: -175.954499600891 hartree
chargesum: -0.0000000
charge: -0.075037 -0.073909 -0.173578 -0.172709 -0.168875 -0.237009 -0.473032 -0.248682 -0.116544 -0.146491 -0.177086 0.251255 -0.075218 -0.014071 0.205891 0.479405 -0.080255 -0.213264 -0.175740 -0.105685 -0.174862 -0.055449 0.094959 0.079913 0.030845 -0.178282 -0.143938 -0.256062 0.370399 0.124096 -0.103806 0.128251 0.119585 0.135749 0.129918 0.130644 0.146684 0.152273 0.129589 0.093891 0.106762 0.109538 0.183609 0.120801 0.113536 0.101011 0.100979
qa: -0.0750 -0.0739 -0.1736 -0.1727 -0.1689 -0.2370 -0.4730 -0.2487 -0.1165 -0.1465 -0.1771 0.2513 -0.0752 -0.0141 0.2059 0.4794 -0.0803 -0.2133 -0.1757 -0.1057 -0.1749 -0.0554 0.0950 0.0799 0.0308 -0.1783 -0.1439 -0.2561 0.3704 0.1241 -0.1038 0.1283 0.1196 0.1357 0.1299 0.1306 0.1467 0.1523 0.1296 0.0939 0.1068 0.1095 0.1836 0.1208 0.1135 0.1010 0.1010
va: 1.2279 1.2304 1.1382 1.1422 1.1456 1.9979 2.0332 1.9234 2.9887 3.2204 2.9004 3.9008 3.9043 3.7709 3.8485 4.4799 3.8090 4.0901 4.0773 3.9082 4.0233 3.8751 3.9041 3.9381 3.6400 3.9936 4.0579 3.9235 4.1133 4.1089 3.8966 1.0069 1.0222 1.0235 1.0396 1.0097 1.0248 1.0098 1.0168 1.0057 1.0035 0.9955 1.0145 1.0423 0.9940 0.9939 0.9938
dispcorr: -0.023083609 hartree
energy: -2381.774742219716
dipole: -66.86726 66.55615 -0.31111 8.56015 -6.99687 1.56328 -1.13505 1.46765 0.33260
magnitude: 1.62826 au
magnitude: 4.13872 debye
