program: Orca
programVersion: 5.0.2
elementType: Cl Cl F F F O O O N N N C C C C C C C C C C C C C C C C C C C C H H H H H H H H H H H H H H H H
charge: 0
multiplicity: 1
keywords: wb97x-d3
keywords: def2-TZVPP
keywords: def2/J RIJCOSX
keywords: DEFGRID2
keywords: scfconv7
keywords: smallprint printgap noloewdin
keywords: NOSOSCF
formula: C20H16Cl2F3N3O3
InChI: InChI=1/C20H16Cl2F3N3O3/c1-11-5-12(3-4-16(11)18(29)26-10-27-30-2)17-9-19(31-28-17,20(23,24)25)13-6-14(21)8-15(22)7-13/h3-8,10,26H,9H2,1-2H3
47 atoms
Cl 5.483675 1.47598 -3.094892
Cl 4.967907 3.075254 2.001221
F  3.685266 -1.834156 2.129215
F  2.44226 -3.299753 1.159575
F  4.248657 -2.627364 0.207436
O  1.982456 -1.687491 -0.97951
O  -6.145808 -0.592271 1.612245
O  -9.246805 1.303091 -1.551579
N  0.616688 -1.660349 -1.053939
N  -6.097874 0.304136 -0.465627
N  -7.886418 1.14002 -1.594239
C  2.437976 -1.109925 0.245833
C  1.155534 -0.720901 0.994182
C  3.371899 0.050806 -0.038832
C  0.125099 -1.14249 -0.003502
C  3.212102 -2.231869 0.946008
C  -1.31604 -0.957982 0.156673
C  3.693041 0.936894 0.983294
C  3.93117 0.209833 -1.299784
C  -1.813405 -0.392121 1.326816
C  -2.207062 -1.315097 -0.854569
C  -3.172447 -0.165031 1.523794
C  4.796419 1.268886 -1.522373
C  4.567818 1.977885 0.7273
C  -4.047474 -0.500048 0.48437
C  -3.555112 -1.074058 -0.688611
C  5.132841 2.165319 -0.523174
C  -3.625788 0.446676 2.816533
C  -5.51562 -0.277131 0.620785
C  -7.451417 0.541388 -0.566324
C  -9.686921 1.934744 -2.735317
H  1.099369 0.350759 1.188854
H  1.019518 -1.225227 1.952919
H  3.261783 0.834712 1.970124
H  3.696611 -0.468529 -2.107261
H  -1.131458 -0.105927 2.118081
H  -1.852339 -1.765912 -1.771463
H  -4.23538 -1.355515 -1.482992
H  5.810945 2.985715 -0.712363
H  -4.118329 -0.285184 3.455373
H  -4.325071 1.267644 2.66417
H  -2.773563 0.838877 3.368202
H  -5.515604 0.617859 -1.231184
H  -8.069356 0.196507 0.256587
H  -9.475537 1.33329 -3.623679
H  -9.240328 2.924552 -2.862519
H  -10.765665 2.04704 -2.636983
elementType: Cl F O N C H
totalener: -2381.75198724 hartree
nucrepener: 3233.77069417 hartree
electener: -5615.52268141 hartree
oneelecener: -9702.57678861 hartree
twoeener: 4087.05410720 hartree
cpcmener: -0.03853318 hartree
kineticenergy: 2374.73004603 hartree
xcener: -175.954986962339 hartree
chargesum: 0.0000000
charge: -0.075043 -0.073830 -0.173701 -0.172635 -0.168651 -0.236346 -0.473776 -0.248776 -0.116452 -0.146826 -0.177095 0.253481 -0.077084 -0.011430 0.205693 0.477590 -0.080253 -0.211911 -0.179168 -0.105963 -0.178812 -0.052914 0.095943 0.080700 0.028102 -0.174148 -0.144146 -0.255684 0.373544 0.123677 -0.103614 0.127205 0.120285 0.136404 0.129059 0.129503 0.147233 0.151392 0.129503 0.106311 0.109027 0.094032 0.184098 0.120379 0.101062 0.100475 0.113557
qa: -0.0750 -0.0738 -0.1737 -0.1726 -0.1687 -0.2363 -0.4738 -0.2488 -0.1165 -0.1468 -0.1771 0.2535 -0.0771 -0.0114 0.2057 0.4776 -0.0803 -0.2119 -0.1792 -0.1060 -0.1788 -0.0529 0.0959 0.0807 0.0281 -0.1741 -0.1441 -0.2557 0.3735 0.1237 -0.1036 0.1272 0.1203 0.1364 0.1291 0.1295 0.1472 0.1514 0.1295 0.1063 0.1090 0.0940 0.1841 0.1204 0.1011 0.1005 0.1136
va: 1.2279 1.2306 1.1381 1.1423 1.1455 1.9982 2.0322 1.9229 2.9915 3.2240 2.9008 3.8955 3.9128 3.7779 3.8487 4.4809 3.8148 4.0875 4.0827 3.9098 4.0278 3.8733 3.9054 3.9373 3.6429 3.9938 4.0580 3.9250 4.1081 4.1105 3.8968 1.0069 1.0211 1.0228 1.0398 1.0100 1.0247 1.0102 1.0167 1.0035 0.9960 1.0055 1.0139 1.0431 0.9937 0.9943 0.9938
dispcorr: -0.023052403 hartree
energy: -2381.775039641363
dipole: -67.62977 67.31560 -0.31417 8.76614 -7.29080 1.47534 -1.31087 1.52739 0.21652
magnitude: 1.52389 au
magnitude: 3.87341 debye
