program: Orca
programVersion: 5.0.2
elementType: Cl Cl F F F O O O N N N C C C C C C C C C C C C C C C C C C C C H H H H H H H H H H H H H H H H
charge: 0
multiplicity: 1
keywords: wb97x-d3
keywords: def2-TZVPP
keywords: def2/J RIJCOSX
keywords: DEFGRID2
keywords: scfconv7
keywords: smallprint printgap noloewdin
keywords: NOSOSCF
formula: C20H16Cl2F3N3O3
InChI: InChI=1/C20H16Cl2F3N3O3/c1-11-5-12(3-4-16(11)18(29)26-10-27-30-2)17-9-19(31-28-17,20(23,24)25)13-6-14(21)8-15(22)7-13/h3-8,10,26H,9H2,1-2H3
47 atoms
Cl 5.656647 -0.330453 -3.129188
Cl 4.54198 3.96311 -0.11767
F  3.420243 0.01662 2.960591
F  2.312564 -1.828472 2.985062
F  4.223329 -1.740927 1.997613
O  2.127378 -1.90207 0.273125
O  -6.314399 -1.558033 0.60335
O  -9.032889 1.895321 -1.341132
N  0.790733 -2.050902 0.076362
N  -6.013943 0.417093 -0.460641
N  -7.678122 1.720469 -1.303185
C  2.415645 -0.66571 0.926661
C  1.040908 -0.020823 1.163911
C  3.340744 0.170794 0.063877
C  0.154099 -1.056498 0.543329
C  3.107011 -1.063402 2.236233
C  -1.300776 -0.972779 0.452027
C  3.513469 1.521793 0.343414
C  4.011883 -0.407083 -1.004685
C  -2.048845 -2.079071 0.049067
C  -1.960528 0.210392 0.758378
C  -3.429732 -2.03851 -0.054315
C  4.83604 0.381915 -1.79157
C  4.343962 2.284435 -0.459014
C  -4.077422 -0.826332 0.231635
C  -3.337417 0.279167 0.634834
C  5.015745 1.7300 -1.535385
C  -4.169033 -3.275269 -0.474631
C  -5.564904 -0.721669 0.156883
C  -7.354695 0.712568 -0.610248
C  -9.349322 2.948976 -2.21711
H  0.950255 0.941976 0.658876
H  0.795321 0.140202 2.215729
H  3.00414 1.994209 1.172268
H  3.888831 -1.453864 -1.238864
H  -1.530794 -3.00018 -0.184901
H  -1.413962 1.084704 1.087122
H  -3.840229 1.203673 0.890949
H  5.658358 2.333787 -2.159952
H  -3.47033 -4.031942 -0.827452
H  -4.879561 -3.078761 -1.276724
H  -4.735927 -3.695944 0.354184
H  -5.358595 1.021553 -0.931138
H  -8.050344 0.046521 -0.110081
H  -8.88864 3.890896 -1.908102
H  -10.432067 3.055674 -2.181205
H  -9.048838 2.732057 -3.245825
totalener: -2381.72182628 hartree
nucrepener: 3233.13641874 hartree
electener: -5614.85824502 hartree
oneelecener: -9701.46254793 hartree
twoeener: 4086.60430291 hartree
kineticenergy: 2374.80599301 hartree
xcener: -175.963493322694 hartree
chargesum: -0.0000000
charge: -0.053233 -0.056729 -0.171382 -0.163100 -0.153317 -0.207347 -0.372876 -0.216173 -0.077218 -0.171869 -0.149375 0.233175 -0.132484 -0.027626 0.181868 0.484713 -0.073986 -0.219975 -0.158100 -0.081875 -0.143710 -0.057808 0.095244 0.081842 0.050988 -0.219373 -0.149391 -0.230707 0.322252 0.108802 -0.105754 0.107066 0.115915 0.120860 0.129986 0.120751 0.118655 0.138701 0.117629 0.083151 0.098184 0.117708 0.153476 0.122101 0.093185 0.103441 0.093715
qa: -0.0532 -0.0567 -0.1714 -0.1631 -0.1533 -0.2073 -0.3729 -0.2162 -0.0772 -0.1719 -0.1494 0.2332 -0.1325 -0.0276 0.1819 0.4847 -0.0740 -0.2200 -0.1581 -0.0819 -0.1437 -0.0578 0.0952 0.0818 0.0510 -0.2194 -0.1494 -0.2307 0.3223 0.1088 -0.1058 0.1071 0.1159 0.1209 0.1300 0.1208 0.1187 0.1387 0.1176 0.0832 0.0982 0.1177 0.1535 0.1221 0.0932 0.1034 0.0937
va: 1.2513 1.2495 1.1394 1.1552 1.1704 2.0412 2.1281 1.9618 3.0017 3.1981 2.9242 3.9304 3.9405 3.7924 3.8052 4.4660 3.8550 4.0927 4.0859 3.9484 4.0057 3.9267 3.9387 3.9896 3.6457 4.0842 4.0683 3.9393 4.1427 4.0943 3.9263 1.0071 1.0191 1.0279 1.0384 1.0354 1.0115 1.0170 1.0210 1.0059 0.9993 1.0031 1.0369 1.0432 0.9962 0.9957 0.9942
dispcorr: -0.023000828 hartree
energy: -2381.744827106158
dipole: -67.21781 66.95552 -0.26229 1.25936 0.12048 1.37984 -10.02393 9.64080 -0.38313
magnitude: 1.45587 au
magnitude: 3.70052 debye
