program: Orca
programVersion: 5.0.2
elementType: C C C C C C H H H H H C O N C C C C C H C H H F C O N H C C C C C C H H Br C F F F C F C F F F C F F F C H H H
charge: 0
multiplicity: 1
keywords: wb97x-d3
keywords: def2-TZVPP
keywords: def2/J RIJCOSX
keywords: DEFGRID2
keywords: scfconv7
keywords: smallprint printgap noloewdin
keywords: NOSOSCF
formula: C25H14BrF11N2O2
InChI: InChI=1/C25H14BrF11N2O2/c1-39(21(41)12-6-3-2-4-7-12)17-9-5-8-14(18(17)27)20(40)38-19-15(23(29,30)31)10-13(11-16(19)26)22(28,24(32,33)34)25(35,36)37/h2-11,38H,1H3
55 atoms
C  -0.570834 -8.347822 1.890617
C  0.603184 -7.643621 2.121615
C  0.872461 -6.489262 1.398274
C  -0.038721 -6.024826 0.461995
C  -1.21941 -6.726413 0.234295
C  -1.473708 -7.899144 0.938904
H  -0.783455 -9.249253 2.449889
H  1.310553 -7.997012 2.860281
H  1.793659 -5.94656 1.563457
H  0.188531 -5.129139 -0.101639
H  -2.386026 -8.45333 0.757865
C  -2.196309 -6.302448 -0.809389
O  -2.580713 -7.093324 -1.660852
N  -2.624192 -5.01622 -0.797698
C  -2.456322 -4.181184 0.328972
C  -1.757337 -2.98808 0.201325
C  -2.986191 -4.509958 1.567447
C  -1.572916 -2.112109 1.261693
C  -2.793628 -3.670865 2.653779
H  -3.545156 -5.430474 1.675616
C  -2.094409 -2.488934 2.50091
H  -3.201252 -3.935275 3.619153
H  -1.959673 -1.834595 3.350635
F  -1.23289 -2.717725 -0.999388
C  -0.840984 -0.812703 1.198862
O  -0.381817 -0.303726 2.205716
N  -0.737904 -0.201682 -0.006249
H  -1.200734 -0.573721 -0.822588
C  -0.132406 1.063119 -0.117826
C  -0.908958 2.214467 -0.24865
C  1.251717 1.200829 -0.118581
C  -0.318893 3.455606 -0.405852
C  1.853166 2.441385 -0.261953
C  1.06398 3.573476 -0.408013
H  -0.940598 4.329648 -0.521434
H  2.931612 2.496549 -0.264431
Br 2.344222 -0.314501 0.048177
C  -2.40961 2.104118 -0.212634
F  -2.876658 1.345143 -1.209075
F  -2.836775 1.562202 0.93258
F  -3.002922 3.292667 -0.321834
C  1.665327 4.948019 -0.627848
F  0.690108 5.902859 -0.495465
C  2.721416 5.32749 0.436676
F  3.843664 4.627125 0.305165
F  2.228056 5.096282 1.64829
F  3.030532 6.615302 0.360353
C  2.165496 5.079625 -2.083023
F  1.149404 4.851855 -2.908284
F  2.637043 6.293834 -2.34088
F  3.121535 4.195902 -2.346271
C  -3.514358 -4.570175 -1.864017
H  -3.789497 -3.533977 -1.69362
H  -3.029336 -4.642601 -2.835761
H  -4.431406 -5.159031 -1.882179
elementType: C H O N F Br
totalener: -4893.89997439 hartree
nucrepener: 5769.68885360 hartree
twoeener: 7605.80693401 hartree
cpcmener: -0.04819132 hartree
kineticenergy: 4881.93473129 hartree
xcener: -271.443547555204 hartree
chargesum: -0.0000000
charge: -0.165428 -0.139259 -0.154899 -0.177487 -0.005006 -0.198626 0.160772 0.162510 0.160743 0.158272 0.146151 0.457433 -0.537172 -0.078507 -0.064732 0.304910 -0.126537 -0.025245 -0.174302 0.159447 -0.091582 0.162357 0.149458 -0.219178 0.348116 -0.492880 -0.205541 0.201741 0.250952 -0.171884 -0.169696 -0.041907 -0.013282 -0.074787 0.139144 0.130381 0.010640 0.531884 -0.173637 -0.171394 -0.171586 0.187706 -0.191829 0.484925 -0.154592 -0.153804 -0.151881 0.468323 -0.153895 -0.153443 -0.153914 -0.168973 0.115493 0.120524 0.115005
qa: -0.1654 -0.1393 -0.1549 -0.1775 -0.0050 -0.1986 0.1608 0.1625 0.1607 0.1583 0.1462 0.4574 -0.5372 -0.0785 -0.0647 0.3049 -0.1265 -0.0252 -0.1743 0.1594 -0.0916 0.1624 0.1495 -0.2192 0.3481 -0.4929 -0.2055 0.2017 0.2510 -0.1719 -0.1697 -0.0419 -0.0133 -0.0748 0.1391 0.1304 0.0106 0.5319 -0.1736 -0.1714 -0.1716 0.1877 -0.1918 0.4849 -0.1546 -0.1538 -0.1519 0.4683 -0.1539 -0.1534 -0.1539 -0.1690 0.1155 0.1205 0.1150
va: 3.9165 3.8864 3.9043 3.9372 3.5482 3.9904 0.9905 0.9880 0.9910 0.9987 1.0152 3.9966 1.9704 3.0667 3.7460 3.9299 3.9519 3.6589 3.9678 0.9984 3.9133 0.9921 1.0159 1.0736 4.1044 2.0064 3.1597 1.0109 3.6188 3.9619 4.2099 3.9322 3.9486 3.7648 1.0373 1.0304 1.2783 4.4512 1.1284 1.1311 1.1357 4.0582 1.1076 4.4806 1.1630 1.1640 1.1729 4.4771 1.1661 1.1709 1.1658 3.8830 0.9995 0.9917 0.9966
dispcorr: -0.033371350 hartree
energy: -4893.933345739735
dipole: -45.75285 45.27756 -0.47529 -87.04190 87.28944 0.24753 13.94518 -13.58751 0.35767
magnitude: 0.64428 au
magnitude: 1.63764 debye
