program: Orca
programVersion: 5.0.2
elementType: C C C C C C H H H H H C O N C C C C C H C H H F C O N H C C C C C C H H Br C F F F C F C F F F C F F F C H H H
charge: 0
multiplicity: 1
keywords: wb97x-d3
keywords: def2-TZVPP
keywords: def2/J RIJCOSX
keywords: DEFGRID2
keywords: scfconv7
keywords: smallprint printgap noloewdin
keywords: NOSOSCF
formula: C25H14BrF11N2O2
InChI: InChI=1/C25H14BrF11N2O2/c1-39(21(41)12-6-3-2-4-7-12)17-9-5-8-14(18(17)27)20(40)38-19-15(23(29,30)31)10-13(11-16(19)26)22(28,24(32,33)34)25(35,36)37/h2-11,38H,1H3
55 atoms
C  1.325752 -3.382977 0.635077
C  1.083848 -3.43056 -0.732346
C  -0.027931 -4.108394 -1.215697
C  -0.914318 -4.709376 -0.334363
C  -0.683974 -4.64601 1.037383
C  0.452579 -4.001968 1.517289
H  2.19477 -2.862795 1.015456
H  1.762889 -2.943698 -1.419946
H  -0.212133 -4.162095 -2.280271
H  -1.782567 -5.227285 -0.721432
H  0.643595 -3.95843 2.58194
C  -1.61788 -5.265516 2.025701
O  -1.207419 -6.058069 2.862436
N  -2.931822 -4.924837 1.963166
C  -3.392479 -3.898657 1.114608
C  -2.826208 -2.633128 1.175853
C  -4.396832 -4.12067 0.180979
C  -3.116081 -1.649529 0.245954
C  -4.784397 -3.114246 -0.688622
H  -4.859881 -5.097651 0.125983
C  -4.132674 -1.891837 -0.673326
H  -5.569938 -3.298042 -1.407858
H  -4.392507 -1.129192 -1.395238
F  -1.948925 -2.372718 2.149553
C  -2.354353 -0.372577 0.142392
O  -2.901219 0.694826 -0.062853
N  -1.005902 -0.504046 0.203048
H  -0.58591 -1.425518 0.236027
C  -0.151339 0.578123 -0.085394
C  0.385976 1.365049 0.931759
C  0.199941 0.86887 -1.398517
C  1.247489 2.40966 0.641604
C  1.060777 1.911816 -1.70195
C  1.580884 2.690141 -0.679067
H  1.649005 2.993883 1.454959
H  1.317065 2.107913 -2.732918
Br -0.487709 -0.180367 -2.79411
C  0.052326 1.040889 2.363723
F  0.496266 -0.173397 2.702657
F  0.600553 1.910296 3.21333
F  -1.263562 1.06048 2.592055
C  2.539617 3.80777 -1.049721
F  2.496431 4.018901 -2.403903
C  2.138541 5.170177 -0.433365
F  2.370748 5.213628 0.875168
F  0.843427 5.379711 -0.636629
F  2.80412 6.16772 -1.000731
C  4.000766 3.391539 -0.755198
F  4.86914 4.322394 -1.134252
F  4.186238 3.149701 0.537284
F  4.278439 2.280384 -1.429808
C  -3.872328 -5.608998 2.843089
H  -4.869536 -5.216231 2.67052
H  -3.885183 -6.680496 2.648604
H  -3.620606 -5.443298 3.890303
elementType: C H O N F Br
totalener: -4893.89700995 hartree
nucrepener: 6059.53462504 hartree
twoeener: 7895.66381984 hartree
cpcmener: -0.04973155 hartree
kineticenergy: 4881.91374897 hartree
xcener: -271.441617385531 hartree
chargesum: 0.0000000
charge: -0.179677 -0.151073 -0.142187 -0.160726 0.010165 -0.152214 0.154612 0.155585 0.155419 0.155566 0.145417 0.426357 -0.532040 -0.071878 0.002027 0.180688 -0.127255 -0.007982 -0.152207 0.163863 -0.145733 0.162825 0.152736 -0.204467 0.384238 -0.491982 -0.230301 0.228591 0.265681 -0.201388 -0.217308 0.011695 0.009405 -0.088635 0.141251 0.130574 0.006765 0.531100 -0.173327 -0.172303 -0.172589 0.183374 -0.191406 0.483829 -0.154265 -0.153382 -0.151823 0.467995 -0.153547 -0.153332 -0.154721 -0.168368 0.112635 0.121100 0.112625
qa: -0.1797 -0.1511 -0.1422 -0.1607 0.0102 -0.1522 0.1546 0.1556 0.1554 0.1556 0.1454 0.4264 -0.5320 -0.0719 0.0020 0.1807 -0.1273 -0.0080 -0.1522 0.1639 -0.1457 0.1628 0.1527 -0.2045 0.3842 -0.4920 -0.2303 0.2286 0.2657 -0.2014 -0.2173 0.0117 0.0094 -0.0886 0.1413 0.1306 0.0068 0.5311 -0.1733 -0.1723 -0.1726 0.1834 -0.1914 0.4838 -0.1543 -0.1534 -0.1518 0.4680 -0.1535 -0.1533 -0.1547 -0.1684 0.1126 0.1211 0.1126
va: 3.8760 3.8087 3.8561 3.9232 3.5148 3.9346 0.9955 0.9940 0.9934 0.9979 1.0136 4.0463 1.9752 3.1193 3.7212 4.0513 3.9085 3.5489 3.9405 0.9961 3.9501 0.9894 1.0089 1.1018 4.1197 2.0095 3.0463 0.9871 3.5002 4.0578 4.1731 3.8980 3.8790 3.7823 1.0403 1.0256 1.2768 4.4473 1.1274 1.1338 1.1314 4.0588 1.1084 4.4813 1.1629 1.1646 1.1728 4.4786 1.1704 1.1658 1.1648 3.8842 1.0001 0.9898 0.9952
dispcorr: -0.038962903 hartree
energy: -4893.935972854592
dipole: -34.69371 34.09438 -0.59933 -66.71275 65.77708 -0.93567 25.51776 -27.48124 -1.96349
magnitude: 2.25609 au
magnitude: 5.73453 debye
